program: Gaussian 09
title: 000159216
version: EM64L-G09RevD.01
frameworkgroup: C1[X(C19H18O4)]
method: RPBEPBE
basis: SDD
operation: Freq
keyword: #pfreq=noraman
keyword: PBEPBE/SDD
title: #p freq=noraman PBEPBE/SDD
converged: YES YES NO NO
title: Mulliken charges:
elementType: O O O O C C C C C C C C C C C C C C C C C C C H H H H H H H H H H H H H H H H H H
charge: -0.460045 -0.432739 -0.479537 -0.446925 -0.345947 -0.219790 0.186982 -0.212681 -0.171915 0.205509 0.126630 0.270290 -0.401665 0.389710 -0.430181 0.146107 0.477370 -0.793704 -0.911362 -0.337491 -0.458559 -0.261976 -0.252568 0.235759 0.222011 0.272843 0.273533 0.277992 0.225334 0.228081 0.350319 0.345560 0.370574 0.359362 0.262011 0.252329 0.215278 0.221105 0.244205 0.227806 0.230385
chargesum: 0.00000
title: Mulliken charges with hydrogens summed into heavy atoms:
elementType: O O O O C C C C C C C C C C C C C C C C C C C
charge: -0.109727 -0.087179 -0.108963 -0.087563 -0.110188 0.002221 0.186982 0.060162 0.101618 0.205509 0.126630 0.270290 -0.123673 0.389710 -0.204848 0.146107 0.477370 -0.565623 -0.181743 -0.116386 -0.214354 -0.034170 -0.022184
polarizability: 3.48857683e+02 2.48872292e+00 2.32933316e+02 2.67716255e+00 -2.70000455e+00 1.18400845e+02
1716.lowfreq: -7.7368 -3.5582 -0.0008 -0.0007 -0.0007 5.2520 25.2374 55.2521 77.9421
frequency: 24.9767 55.2296 77.9369 95.5394 139.0857 141.3955 152.6582 181.8444 203.6594 235.3808 244.8183 264.2797 281.9322 285.3806 298.8344 310.3515 324.2837 328.1664 352.4062 372.0570 388.9609 425.8154 438.1488 456.9221 472.3117 489.3760 501.7866 527.2147 530.6000 544.9506 561.7741 577.6514 593.5604 610.7923 644.8820 657.4747 687.9579 723.0747 743.8734 759.1487 765.5785 807.7643 815.2475 828.7248 850.9980 857.8680 873.2002 878.2407 895.5248 921.3352 922.5153 958.9811 970.3857 984.5810 991.2099 997.0667 1008.3984 1014.8034 1034.7222 1053.7924 1056.0978 1060.2448 1094.6864 1105.2966 1130.8597 1160.6119 1172.6023 1179.6419 1203.6651 1209.2793 1222.5085 1231.6195 1239.5265 1269.0696 1275.8245 1285.7484 1294.1444 1300.3872 1317.6466 1343.8676 1349.9165 1359.7113 1364.8555 1380.4965 1392.8298 1399.9172 1402.1165 1415.6932 1424.8462 1441.2878 1452.4015 1482.9950 1490.5318 1509.2392 1538.1054 1579.5064 1602.8881 1615.0664 1629.6873 2939.1324 2966.7934 3040.3893 3047.5643 3056.3143 3078.3899 3085.2845 3112.5983 3122.3132 3134.1582 3148.8588 3156.3778 3166.5897 3177.8868 3306.9677 3441.9217 3514.1875 3565.1013
redmass: 5.0573 4.9212 4.0272 4.9957 5.4849 4.4371 6.2395 5.3600 6.2847 1.3829 3.4831 4.4422 4.1529 5.2777 4.1787 1.2734 2.3659 3.7633 2.1431 1.6414 5.8009 4.5526 3.8601 4.4314 4.3520 4.3962 4.8411 4.0841 4.8612 1.6960 2.2023 4.2809 3.7612 3.8474 5.7917 3.9629 5.5260 1.3939 2.9420 1.3817 2.5952 3.1702 4.4184 3.2788 3.4621 1.4025 2.3386 3.7149 5.3756 2.0885 3.4977 1.4324 3.8442 1.4526 1.3460 4.3036 4.1871 2.1906 2.6339 3.1050 1.7499 1.9704 1.9211 2.0696 1.5844 1.2229 1.2201 1.1298 1.4388 1.2761 2.2922 1.4363 1.5237 2.1220 1.6595 1.2641 1.8432 1.6040 2.4915 1.6716 1.3961 3.1522 1.9096 1.5540 1.4945 1.3736 1.9922 4.4491 1.4465 2.7577 3.1517 1.4382 1.6947 1.1525 4.0483 7.7814 5.8048 6.7183 6.4219 1.0843 1.0412 1.0837 1.0857 1.0897 1.0882 1.0989 1.0907 1.0864 1.0887 1.0919 1.0906 1.0990 1.0948 1.0668 1.0646 1.0656 1.0666
irintensity: 0.3212 1.2743 0.1596 3.6322 1.3611 3.1279 1.5140 3.5839 2.4979 131.4500 36.0912 17.4562 2.2527 33.5047 5.9327 92.2190 0.7039 4.4357 46.2903 19.9388 4.2776 9.7908 1.0209 3.1768 15.4864 8.4156 0.3245 6.7862 0.4519 32.4602 25.5153 10.3336 21.6866 9.4651 2.8427 16.5507 8.0964 124.9647 40.9463 41.0655 45.8380 44.9622 20.0327 7.6598 20.9705 17.0441 5.0458 3.3767 56.7463 9.4249 30.2687 3.6629 38.4923 2.5793 0.9670 47.2903 55.1683 10.4360 14.5179 40.8392 1.4461 29.9476 2.0579 40.6049 26.8543 28.6731 24.7687 11.6846 10.6953 31.2101 11.6633 1.7150 13.8855 10.1754 10.9353 8.1185 8.8115 12.0715 6.6169 15.0247 8.1372 13.3517 15.9124 40.2165 3.9005 31.1725 4.2367 2.2471 73.6576 2.7691 5.2854 14.8079 18.4835 24.8055 2.2436 0.7305 6.5159 3.9831 0.8420 74.3166 43.8608 6.7403 26.2239 27.9206 46.0213 5.3803 18.6970 5.9248 9.8487 14.9409 17.3787 20.1425 24.3675 140.1791 37.3654 6.5572 5.2804
temp: 298.150 k
press: 1.00000 atm
elementType: 8 8 8 8 6 6 6 6 6 6 6 6 6 6 6 6 6 6 6 6 6 6 6 1 1 1 1 1 1 1 1 1 1 1 1 1 1 1 1 1 1
symmnumber: 1
zpe: 856428.6 jmol-1
zpe.correction: 0.326196 hartree
zpe.thermalcorrener: 0.345306 hartree
zpe.thermalcorrenthalpy: 0.346250 hartree
zpe.thermalcorrgfe: 0.280093 hartree
zpe.sumelectzpe: -1034.071313 hartree
zpe.sumelectthermal: -1034.052204 hartree
zpe.sumelectthermalent: -1034.051259 hartree
zpe.sumelectthermalfe: -1034.117417 hartree
dipole: -1.6406 5.2230 1.2510
dipole: 5.6157
quadrupole: -132.9649 -118.8257 -139.7908
quadrupole: 18.6111 3.6977 1.8988
quadrupole: -2.4377 11.7014 -9.2637 18.6111 3.6977 1.8988
hfenergy: -1034.3975095 hartree
pointgroup: C01 [X(C19H18O4)]
dipole: -0.6571774 2.0576534 0.4642359 debye
polarizability: 348.7841689|3.0155421|232.8802903|4.3495626|-3.954945|118.5273842 unknown
InChI: InChI=1S/C19H18O4/c1-9-8-10-4-2-3-5-11(10)12-6-7-13-15(14(9)12)17(21)19(23)18(22)16(13)20/h2-8,16-23H,1H3
charge 0 multiplicity 1
41 atoms
O  2.324532 1.797436 -1.334638
O  3.62792 0.823196 2.080526
O  4.225376 -0.165156 -1.462947
O  3.556183 -2.590745 -0.398814
C  2.190397 1.391685 0.118992
C  3.614426 1.048849 0.628366
C  1.183191 0.250816 0.158307
C  4.132509 -0.253894 0.00532
C  3.19243 -1.408014 0.390969
C  1.702936 -1.064234 0.235374
C  -0.258107 0.478233 0.085783
C  -1.129738 -0.689178 0.096265
C  0.824599 -2.179278 0.22478
C  -0.907095 1.801072 -0.006134
C  -0.549267 -1.990818 0.161619
C  -2.590347 -0.568636 0.038251
C  -3.170013 0.740228 -0.043451
C  -2.294077 1.875774 -0.068759
C  -0.194635 3.149411 -0.050644
C  -3.481996 -1.688345 0.055495
C  -4.588931 0.903909 -0.104953
C  -4.871375 -1.514641 -0.004674
C  -5.435718 -0.208455 -0.085756
H  1.830406 2.264546 0.688567
H  4.291528 1.891126 0.360344
H  5.15368 -0.471174 0.355736
H  3.379559 -1.688224 1.442118
H  1.259631 -3.182188 0.254708
H  -1.194428 -2.87237 0.160755
H  -2.761535 2.865811 -0.144343
H  2.851083 2.639305 -1.388578
H  3.321956 1.639574 2.55014
H  3.466558 0.409573 -1.785398
H  3.770575 -2.240086 -1.309095
H  0.581156 3.177728 -0.833985
H  -0.927388 3.941437 -0.279807
H  0.262583 3.420496 0.920845
H  -3.093865 -2.708582 0.116625
H  -5.002226 1.917583 -0.167925
H  -5.528674 -2.390988 0.010419
H  -6.522699 -0.082282 -0.132904
