program: Gaussian 09
title: 000013963
version: EM64L-G09RevD.01
frameworkgroup: C1[X(C10H8O10S2)]
method: RPBEPBE
basis: SDD
operation: Freq
keyword: #p
keyword: freq=noraman
keyword: PBEPBE/SDD
title: #p freq=noraman PBEPBE/SDD
converged: YES YES NO NO
title: Mulliken charges:
elementType: S S O O O O O O O O O O C C C C C C C C C C H H H H H H H H
charge: 1.061081 1.161987 -0.220352 -0.412017 -0.313760 -0.140072 -0.557903 -0.525600 -0.461790 -0.501338 -0.452442 -0.421548 0.302165 0.234292 0.409924 -0.424219 0.219372 0.158908 -0.451603 -0.451356 -0.798319 0.143051 0.295404 0.308179 0.270776 0.276834 0.247078 0.248493 0.381824 0.412951
chargesum: 0.00000
title: Mulliken charges with hydrogens summed into heavy atoms:
elementType: S S O O O O O O O O O O C C C C C C C C C C
charge: 1.061081 1.161987 -0.220352 -0.412017 -0.313760 -0.140072 -0.176079 -0.112650 -0.461790 -0.501338 -0.452442 -0.421548 0.302165 0.234292 0.409924 -0.128814 0.219372 0.158908 -0.143424 -0.180580 -0.025913 0.143051
polarizability: 4.44549993e+02 4.35916542e+01 3.49158735e+02 -1.71335499e-01 -3.44277056e+00 1.40062801e+02
1716.lowfreq: -5.6860 -2.0195 -0.0016 0.0008 0.0012 5.6959 21.4370 29.2824 30.9046
frequency: 21.2881 29.2674 30.8353 33.8852 43.3589 62.8626 86.9597 96.2238 98.7564 112.6457 132.0136 157.8976 174.3114 180.1870 193.3507 207.0211 221.4090 234.6344 251.2921 279.8464 287.0081 301.2312 316.1348 320.4845 340.2405 354.0051 367.9198 382.4011 394.2189 397.5415 414.5971 482.2535 486.9031 512.3964 529.5795 549.2474 563.4631 610.9660 623.8430 649.8025 684.8122 718.5592 731.2686 740.6323 752.7076 774.9467 834.1505 857.4108 862.0738 862.3968 881.1939 883.8550 888.5821 989.8089 990.1065 1044.7837 1048.7693 1051.1659 1100.6972 1158.4982 1206.6323 1227.4668 1253.8100 1298.0547 1332.5900 1364.1783 1380.8765 1404.8728 1425.4171 1455.0311 1463.1287 1471.2437 1483.4867 1571.5143 1609.4621 1700.8540 2430.2276 2983.7781 3061.0885 3112.1373 3177.2088 3189.3478 3203.8624 3448.1671
redmass: 12.2119 10.3386 7.3162 13.1122 11.9714 8.1276 10.9844 9.6991 12.6382 9.8530 10.9958 6.6432 2.6164 6.8582 3.4897 1.6656 7.7931 5.6624 8.6420 7.6379 9.6404 7.2526 5.8446 10.1985 2.0884 3.1203 8.7172 7.6182 6.9901 11.4719 5.5177 4.4664 5.3703 13.9803 5.9573 5.0713 7.4543 10.3180 9.1837 4.7683 5.9205 6.2674 3.8217 5.4097 7.5097 16.0352 1.1702 4.0795 1.6218 6.0280 8.6355 1.5870 1.4029 3.0788 4.2789 3.9758 1.5778 1.1707 2.6797 4.5467 3.1654 1.8625 1.6016 3.0100 4.2710 1.4664 3.4181 1.3048 2.6822 7.2435 1.0497 1.1404 5.2546 6.0272 6.8596 11.3348 1.0810 1.0390 1.0970 1.0986 1.0924 1.0931 1.0924 1.0657
irintensity: 2.4321 4.6925 1.1604 0.5121 0.3420 2.4135 1.1711 1.7713 4.3996 2.7219 3.6794 3.2141 1.8103 2.9403 2.3795 3.9759 8.8964 6.9159 8.9094 9.3784 9.2786 13.2959 7.4993 10.2047 60.6464 48.7350 37.8655 28.6580 14.1012 87.8005 44.5301 9.0505 7.8506 162.9019 15.8325 2.2155 7.6751 147.4421 12.7311 2.7199 9.7932 24.9089 6.5742 49.9880 16.3974 65.3195 71.2217 124.3589 2.4441 111.1839 62.3106 10.9469 55.4344 84.7891 26.3808 38.0679 10.6449 168.0171 143.0097 39.2832 12.0431 43.4136 5.9391 121.4755 28.0091 191.4520 43.1019 39.1982 2.7577 91.0212 20.7430 4.5331 30.9864 183.1327 89.9508 505.3575 342.5467 1.9610 4.2077 16.6242 0.0803 3.4825 1.3566 77.0566
temp: 298.150 k
press: 1.00000 atm
elementType: 16 16 8 8 8 8 8 8 8 8 8 8 6 6 6 6 6 6 6 6 6 6 1 1 1 1 1 1 1 1
symmnumber: 1
zpe: 458427.8 jmol-1
zpe.correction: 0.174606 hartree
zpe.thermalcorrener: 0.198192 hartree
zpe.thermalcorrenthalpy: 0.199136 hartree
zpe.thermalcorrgfe: 0.118869 hartree
zpe.sumelectzpe: -1932.225480 hartree
zpe.sumelectthermal: -1932.201894 hartree
zpe.sumelectthermalent: -1932.200950 hartree
zpe.sumelectthermalfe: -1932.281217 hartree
dipole: -6.0948 1.0111 4.0133
dipole: 7.3672
quadrupole: -161.0998 -168.8318 -142.8668
quadrupole: -17.0419 -5.2781 9.3570
quadrupole: -3.5003 -11.2324 14.7327 -17.0419 -5.2781 9.3570
hfenergy: -1932.4000858 hartree
pointgroup: C01 [X(C10H8O10S2)]
dipole: -2.2503404 0.9891562 1.5358079 debye
polarizability: 455.2818991|24.7142967|333.1084187|-15.0763801|-31.0131065|145.3812119 unknown
InChI: InChI=1S/C10H6O4.2HO3S/c1-5-2-10(13)14-9-4-8(12)7(11)3-6(5)9;2*1-4(2)3/h2-4H,1H3;2*1H
charge 0 multiplicity 1
30 atoms
S  2.40841 2.391822 -1.078747
S  2.883275 -2.819142 0.534051
O  -3.190283 -1.315654 -0.503599
O  2.004744 0.38042 0.388304
O  1.476477 -2.129757 -0.885326
O  -5.479746 -0.983671 -0.445438
O  3.134176 3.106517 0.478054
O  3.887283 -1.377175 0.4850
O  3.357285 2.950698 -2.266916
O  0.815566 2.803427 -1.12981
O  2.066923 -2.954215 1.916969
O  3.670989 -4.040346 -0.12531
C  -1.668575 0.448893 0.296926
C  -1.913818 -0.863079 -0.270997
C  -2.809029 1.324622 0.571473
C  -0.339763 0.824873 0.539839
C  0.760867 -0.031289 0.195129
C  0.474514 -1.354542 -0.418181
C  -0.865288 -1.751831 -0.597422
C  -4.084911 0.858431 0.318295
C  -2.57429 2.716969 1.102526
C  -4.38235 -0.467179 -0.20589
H  -0.104398 1.794192 0.980966
H  -1.09252 -2.733561 -1.020429
H  -4.961571 1.485209 0.50278
H  -1.910383 3.288524 0.427032
H  -2.083839 2.688634 2.093971
H  -3.52103 3.268807 1.20792
H  2.929714 2.41941 1.180732
H  3.19957 -0.57321 0.400097
