program: Gaussian 09
title: 000159140
version: EM64L-G09RevD.01
frameworkgroup: C1[X(C13H11NO2)]
method: RPBEPBE
basis: SDD
operation: Freq
keyword: #p
keyword: freq=noraman
keyword: PBEPBE/SDD
title: #p freq=noraman PBEPBE/SDD
converged: YES YES NO NO
title: Mulliken charges:
elementType: O O N C C C C C C C C C C C C C H H H H H H H H H H H
charge: -0.430240 -0.437801 -0.004491 -0.347852 -0.247980 0.330615 0.257786 -0.083524 0.223661 -0.397406 -0.386234 -0.302426 -0.242458 -0.253090 -0.182282 -0.374880 0.273587 0.258818 0.245715 0.224638 0.237861 0.233230 0.341383 0.231035 0.355456 0.231288 0.245590
chargesum: 0.00000
title: Mulliken charges with hydrogens summed into heavy atoms:
elementType: O O N C C C C C C C C C C C C C
charge: -0.088857 -0.082345 -0.004491 -0.074265 0.010838 0.330615 0.257786 -0.083524 0.223661 -0.151690 -0.161596 -0.064565 -0.009228 -0.022055 0.049006 -0.129290
polarizability: 2.18426917e+02 -2.73285857e+00 1.57422758e+02 -6.29795131e+00 1.45294043e+00 8.06286672e+01
1716.lowfreq: -14.9004 -8.7805 -3.1627 -0.0007 0.0003 0.0005 53.6009 74.2539 115.4604
frequency: 53.5750 74.2529 115.4597 116.5133 200.9170 206.0501 233.1912 273.9415 315.9683 327.5717 346.8004 385.9959 414.8758 440.1482 442.6834 503.0770 503.7285 563.7487 574.1222 606.7560 616.0930 689.0232 707.9291 755.8335 765.7241 788.9008 809.2518 824.6112 856.9715 879.4357 932.1859 934.0457 955.1290 963.5688 983.7661 984.1167 992.4781 1024.5593 1048.1927 1057.1167 1087.8118 1131.9967 1165.9870 1178.5106 1191.9465 1204.6962 1224.2617 1231.8750 1271.4582 1295.8618 1306.0005 1324.9758 1347.5612 1351.8630 1369.0746 1383.6192 1418.4432 1432.9545 1457.8850 1488.8767 1549.8023 1580.6060 1588.9494 1614.3046 3022.8844 3076.1325 3127.8251 3133.1540 3135.4214 3144.8798 3149.9981 3166.1026 3169.0701 3542.7813 3558.2787
redmass: 5.4123 4.7376 4.7623 4.9483 5.4915 4.5132 4.6114 1.1537 4.0904 4.3228 1.1768 7.2303 4.1953 4.1159 4.8518 4.4511 5.0769 3.8470 3.6353 4.5893 6.4459 5.5859 5.1895 3.7891 1.4193 2.0830 4.0960 2.2309 4.2132 1.4851 4.3356 1.5352 1.4898 5.1526 3.9238 1.6939 1.3424 2.7033 2.0581 2.3139 2.4628 1.4364 1.1844 1.0820 1.5938 1.4088 1.4450 1.8905 1.5427 2.3142 2.0809 3.0123 1.3149 1.6564 1.6988 3.3192 2.9228 2.1289 2.8023 2.8598 5.3108 6.0881 7.1915 6.4322 1.0851 1.0866 1.0852 1.0874 1.0894 1.0921 1.0931 1.1007 1.0997 1.0664 1.0663
irintensity: 1.7764 0.1337 0.5427 3.9967 1.3624 0.4750 1.6699 89.3999 21.2996 5.2534 163.6937 2.1046 3.1260 0.6934 2.0639 4.8534 0.7720 11.9859 25.5397 15.2109 3.2693 6.2036 10.6492 12.4087 59.7082 59.3063 20.6897 6.9168 10.6737 1.1018 112.0882 11.4533 2.4365 16.6394 2.8308 1.5613 0.1228 3.5988 0.9081 0.2965 9.6675 0.6325 15.7032 2.3749 15.1774 39.5801 31.2722 3.9497 5.2003 9.5982 0.4793 2.5749 34.3231 1.2849 29.1231 1.6428 38.5267 14.9366 8.5999 4.2641 2.4241 1.0227 2.0231 0.7919 22.1288 12.6580 2.4245 1.5864 8.5233 21.5285 15.2735 35.7013 26.3959 8.7030 11.4799
temp: 298.150 k
press: 1.00000 atm
elementType: 8 8 7 6 6 6 6 6 6 6 6 6 6 6 6 6 1 1 1 1 1 1 1 1 1 1 1
symmnumber: 1
zpe: 548452.9 jmol-1
zpe.correction: 0.208895 hartree
zpe.thermalcorrener: 0.221660 hartree
zpe.thermalcorrenthalpy: 0.222604 hartree
zpe.thermalcorrgfe: 0.169898 hartree
zpe.sumelectzpe: -706.054701 hartree
zpe.sumelectthermal: -706.041935 hartree
zpe.sumelectthermalent: -706.040991 hartree
zpe.sumelectthermalfe: -706.093698 hartree
dipole: -0.2279 4.0390 0.0556
dipole: 4.0458
quadrupole: -80.9579 -88.4804 -97.5919
quadrupole: -2.2485 0.0376 3.7448
quadrupole: 8.0522 0.5297 -8.5818 -2.2485 0.0376 3.7448
hfenergy: -706.2635956 hartree
pointgroup: C01 [X(C13H11N1O2)]
dipole: -0.1099063 1.5878048 -0.0218413 debye
polarizability: 218.6982219|-2.0856162|157.3812589|-3.1907123|-0.6713252|80.3988605 unknown
InChI: InChI=1S/C13H11NO2/c15-12-10-5-2-1-4-8(10)9-6-3-7-14-11(9)13(12)16/h1-7,12-13,15-16H
charge 0 multiplicity 1
27 atoms
O  0.618257 -2.111659 1.855437
O  -0.438284 -2.136658 -1.691834
N  -2.764607 -0.644392 -0.087161
C  0.738341 -1.848936 0.397207
C  -0.654922 -1.866645 -0.250917
C  1.501369 -0.561549 0.136527
C  0.798684 0.672964 -0.007683
C  -1.400852 -0.555539 -0.073791
C  -0.686914 0.677605 0.034746
C  2.912406 -0.579275 0.089231
C  1.548059 1.864603 -0.201354
C  -1.465775 1.857718 0.17338
C  3.646652 0.611625 -0.094922
C  2.956572 1.838012 -0.242456
C  -2.872883 1.776888 0.164737
C  -3.483122 0.509521 0.021285
H  1.298531 -2.719242 0.020445
H  -1.251977 -2.677769 0.207661
H  3.434362 -1.536035 0.204669
H  1.034324 2.820708 -0.347622
H  -0.982704 2.832029 0.298364
H  4.74087 0.585378 -0.13223
H  0.306128 -1.283409 2.304137
H  3.514784 2.767381 -0.399421
H  -1.329599 -2.195529 -2.122305
H  -3.488852 2.675334 0.270472
H  -4.573446 0.403269 0.001395
