program: Gaussian 09
title: 000159193
version: EM64L-G09RevD.01
frameworkgroup: C1[X(C12H10F17NO2S)]
method: RPBEPBE
basis: SDD
operation: Freq
keyword: #p
keyword: freq=noraman
keyword: PBEPBE/SDD
title: #p freq=noraman PBEPBE/SDD
converged: NO YES NO NO
title: Mulliken charges:
elementType: S F F F F F F F F F F F F F F F F F O O N C C C C C C C C C C C C H H H H H H H H H H
charge: 1.013631 -0.112835 -0.124369 -0.118464 -0.136058 -0.113527 -0.114361 -0.144184 -0.116630 -0.113833 -0.122835 -0.116268 -0.129475 -0.117010 -0.128328 -0.121941 -0.119741 -0.124435 -0.487180 -0.493545 -0.333246 0.271255 0.250796 0.245403 0.120137 0.228660 0.212376 0.237270 -0.321430 -0.327681 0.379882 -0.659964 -0.634214 0.267346 0.231077 0.229790 0.256007 0.242012 0.221892 0.229681 0.228404 0.247269 0.218665
chargesum: 0.00000
title: Mulliken charges with hydrogens summed into heavy atoms:
elementType: S F F F F F F F F F F F F F F F F F O O N C C C C C C C C C C C C
charge: 1.013631 -0.112835 -0.124369 -0.118464 -0.136058 -0.113527 -0.114361 -0.144184 -0.116630 -0.113833 -0.122835 -0.116268 -0.129475 -0.117010 -0.128328 -0.121941 -0.119741 -0.124435 -0.487180 -0.493545 -0.333246 0.271255 0.250796 0.245403 0.120137 0.228660 0.212376 0.237270 0.176993 0.158116 0.379882 0.033622 0.060125
polarizability: 2.46448006e+02 1.06880332e+01 1.69337184e+02 -5.03963045e+00 3.13084069e+00 1.62684450e+02
1716.lowfreq: -9.7238 -5.0957 -2.5151 -0.0014 -0.0009 -0.0003 8.9024 15.8944 18.9799
frequency: 6.7571 15.8439 18.8861 31.4097 32.0674 41.2313 48.8588 53.1163 62.8360 67.8020 79.1535 79.7696 83.7793 107.6566 110.5537 131.4465 135.8664 148.0440 152.4451 158.8461 171.4785 180.5743 188.3125 195.7764 203.9909 207.0510 220.6226 227.5157 228.4095 242.9400 248.5696 255.6628 262.3232 265.8814 272.1051 279.4029 284.8158 291.9515 297.9338 299.4222 311.2141 315.2380 328.2001 338.0244 340.8083 351.7379 370.8483 390.2880 404.3705 409.6227 417.9935 436.1302 440.5571 457.7858 481.3789 513.7034 524.2886 533.2062 539.1292 553.3555 561.0619 572.2293 584.9773 625.2311 649.6036 730.4683 743.4147 772.6257 787.2378 828.8308 844.4787 850.3668 913.0851 931.1011 960.7301 972.4805 979.8390 985.3110 1006.8089 1012.5017 1019.5445 1024.5262 1033.5792 1040.1703 1041.2865 1054.5689 1060.8433 1060.8904 1065.7970 1081.7864 1086.4877 1102.0077 1104.0281 1111.2946 1137.0278 1144.2757 1158.6379 1162.5678 1181.8011 1184.2282 1209.1466 1283.0646 1321.0147 1351.7589 1363.4646 1384.3501 1390.6562 1450.6271 1461.8813 1465.0461 1470.5491 1482.8800 1484.4212 2959.2862 2987.5381 2994.6834 2995.3623 3049.9329 3055.2558 3091.2059 3094.1011 3109.7141 3113.9692
redmass: 6.0137 7.3474 7.7043 10.8866 4.9436 7.6188 5.3691 13.3889 15.9017 4.0865 6.5050 5.0265 4.6541 16.7734 15.5773 15.1529 14.3755 3.6335 14.9483 17.9829 16.8809 6.7606 3.3283 17.5610 1.3730 13.4221 12.2687 18.3352 7.7683 14.9733 8.3199 1.8654 5.6360 11.9927 13.8452 3.6833 18.0535 16.4712 18.4414 18.4151 16.9748 2.8914 18.5808 18.7239 17.1221 4.4531 14.7060 8.1162 5.6721 10.0695 17.2261 8.0300 12.7554 17.7581 17.4977 16.9213 8.6763 7.7311 5.7646 14.2235 15.4293 17.2999 17.5620 17.4400 17.0401 13.4183 1.8919 7.6163 1.2111 7.4815 1.9035 9.9626 13.2256 1.9562 13.2350 11.9250 12.5907 12.5387 2.4275 11.2146 13.2348 13.0988 13.2384 12.6887 12.3665 12.2728 3.0492 11.8494 12.8800 2.2103 11.5592 11.9488 1.5776 11.3308 11.9349 12.3883 4.0576 7.3874 1.8264 12.1777 12.2625 1.1452 1.1543 1.2124 1.2483 1.2044 1.1983 1.0645 1.0410 1.0486 1.0610 1.0551 1.0598 1.0647 1.0589 1.0354 1.0373 1.1019 1.0973 1.0992 1.0981 1.1018 1.1018
irintensity: 0.9703 0.5734 0.6247 0.0434 0.3819 0.0301 0.0799 0.1823 0.0601 0.9850 0.7376 0.2458 3.7207 0.2906 1.1054 0.8326 0.6711 1.4902 0.4040 0.0331 2.8683 0.6166 0.8828 9.6456 0.5782 16.6573 0.1683 1.1281 3.7190 0.0428 0.0925 0.3122 0.5868 6.6922 2.7094 5.2374 0.9075 0.8276 0.1130 0.4439 0.4410 1.7034 0.3891 0.0305 1.4611 16.3344 2.0881 62.7416 46.3330 0.9769 13.7087 46.6615 7.2710 17.1582 4.3839 9.0613 10.0129 23.7014 16.1451 21.2523 11.9630 7.8840 2.2867 14.6558 70.0642 232.0753 16.8854 36.3765 5.3049 93.2458 12.2242 56.8757 47.9642 9.3905 6.0947 27.7389 58.0079 31.9977 47.0339 27.8975 28.6106 52.1205 14.8091 26.4542 61.5137 166.5497 10.6710 175.5069 221.1783 83.6935 434.0240 21.1412 7.5959 116.9800 86.2663 47.7876 39.2709 93.1439 3.6266 2.4254 31.5651 16.0398 2.7484 1.3236 2.5482 5.1206 21.3406 5.2835 6.3208 27.9315 17.4264 10.3064 13.4457 29.4604 18.4342 14.6043 38.6894 1.9562 1.0316 38.7260 9.7325 19.1703 21.7270
temp: 298.150 k
press: 1.00000 atm
elementType: 16 9 9 9 9 9 9 9 9 9 9 9 9 9 9 9 9 9 8 8 7 6 6 6 6 6 6 6 6 6 6 6 6 1 1 1 1 1 1 1 1 1 1
symmnumber: 1
zpe: 607623.0 jmol-1
zpe.correction: 0.231431 hartree
zpe.thermalcorrener: 0.268155 hartree
zpe.thermalcorrenthalpy: 0.269099 hartree
zpe.thermalcorrgfe: 0.158739 hartree
zpe.sumelectzpe: -2760.986436 hartree
zpe.sumelectthermal: -2760.949712 hartree
zpe.sumelectthermalent: -2760.948768 hartree
zpe.sumelectthermalfe: -2761.059128 hartree
dipole: 4.2608 3.7797 -2.3844
dipole: 6.1746
quadrupole: -165.2835 -199.1596 -202.9867
quadrupole: 18.2623 -11.0679 0.9614
quadrupole: 23.8597 -10.0163 -13.8434 18.2623 -11.0679 0.9614
hfenergy: -2761.2178673 hartree
pointgroup: C01 [X(C12H10F17N1O2S1)]
dipole: -1.6872042 0.7636666 1.5721312 debye
polarizability: 246.5394518|-7.0225727|170.373657|-9.0243709|1.7162937|161.556531 unknown
InChI: InChI=1S/C8F17.C4H10NO2S/c9-1(10)2(11,12)3(13,14)4(15,16)5(17,18)6(19,20)7(21,22)8(23,24)25;1-3-5(4-2)8(6)7/h;3-4H2,1-2H3
charge 0 multiplicity 1
43 atoms
S  -3.716406 -0.07944 -0.771269
F  -0.986907 -1.374318 -1.874505
F  0.832902 -2.143468 -0.716414
F  -1.422819 -2.223973 0.710739
F  0.072467 -0.713388 1.543205
F  -0.100269 1.217891 -1.712741
F  1.314815 -0.283903 -2.674784
F  -2.644353 -0.104194 1.858379
F  -1.582092 1.397769 0.51628
F  1.458636 1.418812 0.530853
F  2.521693 1.808771 -1.454206
F  3.483589 -1.039605 -1.230549
F  2.801993 -0.882288 0.944748
F  5.186131 0.977204 -1.031613
F  4.203304 1.838087 0.846785
F  5.074385 -0.245029 2.38738
F  6.765371 0.493287 1.077491
F  5.718246 -1.457599 0.57283
O  -3.402469 1.042694 -1.890013
O  -3.948063 -1.642535 -1.110574
N  -5.138119 0.474016 0.214396
C  -0.052973 -1.048338 -0.86288
C  -0.863414 -0.942623 0.487475
C  0.793005 0.157837 -1.437215
C  -2.025614 0.072719 0.597744
C  1.989947 0.794116 -0.61803
C  3.191714 -0.133565 -0.190557
C  4.521193 0.642652 0.163957
C  -5.072008 1.898056 0.643425
C  -5.725944 -0.560658 1.114745
C  5.53047 -0.161525 1.069903
C  -6.485836 2.507864 0.705876
C  -7.126705 -0.989827 0.638365
H  -4.470788 2.444832 -0.10516
H  -4.571131 1.985835 1.630466
H  -5.748203 -0.150316 2.143081
H  -5.066921 -1.44856 1.12974
H  -6.989221 2.425119 -0.271674
H  -7.111846 2.016308 1.470374
H  -6.403232 3.577153 0.972158
H  -7.820341 -0.13408 0.591752
H  -7.065495 -1.443695 -0.364703
H  -7.541493 -1.739699 1.337438
