program: Gaussian 09
title: 000159117
version: EM64L-G09RevD.01
frameworkgroup: C1[X(C7H15O5PS2)]
method: RPBEPBE
basis: SDD
operation: Freq
keyword: #p
keyword: freq=noraman
keyword: PBEPBE/SDD
title: #p freq=noraman PBEPBE/SDD
converged: YES YES NO NO
title: Mulliken charges:
elementType: S S P O O O O O C C C C C C C H H H H H H H H H H H H H H H
charge: 0.044239 0.696348 1.033806 -0.493218 -0.624268 -0.630302 -0.239486 -0.239156 -0.850588 -0.878214 -0.762857 -0.225386 -0.648049 0.313939 -0.497829 0.348957 0.306763 0.276078 0.245145 0.348073 0.380837 0.262723 0.228831 0.200332 0.207629 0.232398 0.239361 0.242081 0.245100 0.236712
chargesum: 0.00000
title: Mulliken charges with hydrogens summed into heavy atoms:
elementType: S S P O O O O O C C C C C C C
charge: 0.044239 0.696348 1.033806 -0.493218 -0.624268 -0.630302 -0.239486 -0.239156 -0.194868 -0.008918 -0.119296 0.203777 0.031339 0.313939 0.226064
polarizability: 2.25335225e+02 7.03721656e-01 1.55951865e+02 1.11102718e+01 -8.32508823e+00 1.24850461e+02
1716.lowfreq: -13.9497 -10.1556 -0.0026 -0.0016 -0.0015 1.6003 19.5153 29.3004 34.6174
frequency: 18.9785 28.8291 33.9030 37.1683 44.4710 59.1848 83.4430 95.1414 98.4565 114.6729 141.8870 153.7864 170.0770 182.1770 192.9614 209.8154 223.4091 245.4096 248.3536 254.8621 272.6110 285.4644 322.7355 357.7330 376.5381 389.8559 400.2261 419.7236 484.7632 618.8405 629.3875 693.6142 711.1475 725.8515 786.4469 797.6619 815.8693 821.8447 884.5514 918.0644 936.5982 961.1160 978.7882 1018.9830 1040.3178 1088.2007 1099.1261 1105.1379 1112.6632 1127.9782 1150.7919 1165.7320 1216.2651 1241.4181 1257.0997 1320.9031 1352.3737 1358.9106 1394.2904 1412.7498 1414.7599 1424.1455 1447.0339 1453.0922 1456.8249 1461.4365 1475.8694 1486.5976 1620.4267 2958.2581 2997.0050 3005.6005 3010.3185 3023.4645 3031.4860 3039.5316 3094.5854 3107.5978 3112.4383 3134.9086 3140.5736 3150.5870 3153.7751 3158.9476
redmass: 4.7180 3.7801 2.2976 4.6448 4.4654 5.4097 3.6143 3.6828 1.4121 5.0431 2.7130 1.3629 3.3951 7.9692 5.6865 4.3093 2.8496 2.1199 1.9618 4.1908 7.2049 4.9203 8.6883 6.4449 4.6311 7.7749 3.1805 5.1493 7.4788 5.7783 4.9304 6.7067 6.8528 6.3749 2.2032 2.5059 1.0901 7.9770 3.5191 2.0204 1.5462 1.3833 5.8742 2.9937 3.6152 1.0881 1.5629 2.1602 1.2733 1.4130 1.4310 1.1034 1.1917 2.3099 1.1507 1.1532 1.2487 1.0826 1.2342 1.0441 1.1174 1.2000 1.0499 1.0495 1.0399 1.0515 1.0568 1.0730 9.0780 1.0567 1.0363 1.0296 1.0299 1.1058 1.0568 1.0538 1.0984 1.1046 1.1018 1.1024 1.1115 1.1037 1.1047 1.1126
irintensity: 0.9855 4.9051 1.2253 2.3391 2.7308 8.4935 4.1046 2.9404 1.0112 2.2076 3.3241 0.6907 9.5754 9.0238 4.6249 1.7611 2.4445 1.5606 1.2838 15.0577 1.0446 10.5958 29.1315 0.7009 16.9486 78.5761 3.7682 0.4998 25.4527 93.6644 3.7006 27.2998 43.9653 5.3567 15.7158 16.0516 3.8221 31.7475 139.1223 6.0508 11.2288 101.5910 34.9438 172.7264 49.6342 7.5276 95.9650 26.7008 1.8622 7.1403 8.6553 17.3504 15.6580 281.3005 1.8742 37.7355 6.5131 9.3164 22.5306 6.1450 5.5144 46.5426 14.1174 14.0836 12.5160 9.0326 9.2524 11.7368 241.4648 37.9193 27.4852 33.4528 9.2635 23.5934 24.4576 7.3972 25.4961 23.8966 28.6134 2.3449 16.8340 4.3407 13.0884 0.8981
temp: 298.150 k
press: 1.00000 atm
elementType: 16 16 15 8 8 8 8 8 6 6 6 6 6 6 6 1 1 1 1 1 1 1 1 1 1 1 1 1 1 1
symmnumber: 1
zpe: 580479.7 jmol-1
zpe.correction: 0.221093 hartree
zpe.thermalcorrener: 0.242309 hartree
zpe.thermalcorrenthalpy: 0.243253 hartree
zpe.thermalcorrgfe: 0.167616 hartree
zpe.sumelectzpe: -1787.903384 hartree
zpe.sumelectthermal: -1787.882168 hartree
zpe.sumelectthermalent: -1787.881224 hartree
zpe.sumelectthermalfe: -1787.956861 hartree
dipole: 2.9708 -0.1271 0.9378
dipole: 3.1179
quadrupole: -100.1269 -105.7412 -116.1305
quadrupole: 8.0472 4.1340 -9.4002
quadrupole: 7.2060 1.5917 -8.7977 8.0472 4.1340 -9.4002
hfenergy: -1788.1244772 hartree
pointgroup: C01 [X(C7H15O5P1S2)]
dipole: -1.1981164 -0.1481395 -0.2174977 debye
polarizability: 224.8245304|-4.4417141|134.7822541|9.8705367|-18.0715623|146.5307675 unknown
InChI: InChI=1S/C4H7O3S2.C3H8O2P/c1-7-4(5)2-9(6)3-8;1-3-5-6(2)4/h2-3H2,1H3;3H2,1-2H3
charge 0 multiplicity 1
30 atoms
S  -1.455195 0.969256 -2.236666
S  1.570258 0.260161 -1.670698
P  -1.737199 0.492893 0.077955
O  -3.295694 1.186814 0.453394
O  -0.612064 1.23378 0.93365
O  0.620009 -0.980487 -1.102666
O  3.266942 -0.576942 1.356195
O  4.715809 0.476221 -0.141512
C  0.184951 1.734921 -1.971123
C  -1.972773 -1.338506 0.292774
C  2.343961 1.107468 -0.055891
C  -4.427374 1.118433 -0.506189
C  -5.579618 1.885894 0.13792
C  3.569834 0.342441 0.354796
C  4.394576 -1.433495 1.798104
H  0.211551 2.340396 -1.051887
H  0.501532 2.276103 -2.873999
H  -2.238399 -1.524078 1.346381
H  -2.778416 -1.68631 -0.372698
H  -1.018559 -1.812687 0.022235
H  1.513552 1.093083 0.668117
H  2.622896 2.118441 -0.390532
H  -4.117859 1.581164 -1.464262
H  -4.706138 0.059863 -0.689677
H  -6.458283 1.881985 -0.533376
H  -5.866907 1.424415 1.097588
H  -5.284744 2.931252 0.32825
H  5.206659 -0.811466 2.210599
H  4.781963 -2.01904 0.94753
H  3.962131 -2.087071 2.567789
