program: Gaussian 09
title: 000159137
version: EM64L-G09RevD.01
frameworkgroup: C1[X(C18H18O2)]
method: RPBEPBE
basis: SDD
operation: Freq
keyword: #pfreq=noraman
keyword: PBEPBE/SDD
title: #p freq=noraman PBEPBE/SDD
converged: YES YES NO NO
title: Mulliken charges:
elementType: O O C C C C C C C C C C C C C C C C C C H H H H H H H H H H H H H H H H H H
charge: -0.289492 -0.398910 0.557012 0.235228 0.499898 -0.501986 -0.633480 0.333339 -0.473591 0.105863 -0.623243 -0.432806 -0.369324 -0.379912 -0.342245 -0.339445 -0.025426 -0.024252 -0.584435 -0.590851 0.281691 0.213783 0.225349 0.233282 0.213041 0.222221 0.231388 0.240866 0.255339 0.257108 0.218665 0.230647 0.230651 0.355488 0.216532 0.219187 0.214622 0.218200
chargesum: 0.00000
title: Mulliken charges with hydrogens summed into heavy atoms:
elementType: O O C C C C C C C C C C C C C C C C C C
charge: -0.289492 -0.043422 0.557012 0.235228 0.499898 -0.220296 -0.194348 0.333339 -0.240309 0.105863 -0.187981 -0.201418 -0.128458 -0.124573 -0.085137 -0.120780 0.205221 0.206398 -0.148716 -0.158029
polarizability: 2.64088235e+02 1.67730077e+01 2.04283446e+02 1.23311528e+01 -4.23258092e+00 1.52022555e+02
1716.lowfreq: -4.0059 -0.0004 -0.0004 0.0004 2.7724 4.8354 7.5285 23.8643 30.0569
frequency: 6.7825 23.6679 30.0207 38.2681 53.9859 65.2266 77.8084 102.0263 117.1720 173.1017 192.8573 213.0889 235.3140 264.6900 306.7063 344.5637 354.7668 357.0782 371.3540 386.4934 393.1511 413.5063 442.6468 467.1363 481.8776 504.4641 538.6021 558.9764 607.5033 632.6990 636.5614 641.9462 694.9774 713.9146 748.8525 775.5973 783.2745 799.8395 822.1324 831.7109 841.3869 883.2631 905.3440 920.3545 927.2958 933.3161 934.5257 945.1064 949.0484 953.1330 958.7255 968.6266 1005.7939 1013.3576 1015.2028 1076.6624 1105.7952 1112.5107 1116.9411 1139.9124 1160.3600 1171.3412 1197.9437 1205.4992 1209.8285 1216.0692 1234.4735 1268.8023 1271.5134 1279.5277 1288.1294 1291.5285 1307.6619 1311.1668 1377.8205 1392.1583 1410.4614 1415.5908 1424.1365 1425.4019 1455.3222 1456.2767 1492.2818 1504.2036 1586.5780 1596.8852 1619.2161 1621.1915 1653.8922 1655.4378 2965.4739 2966.1188 3015.6923 3016.7443 3082.3125 3082.9327 3095.9041 3096.2701 3111.0714 3124.2111 3130.6168 3139.3498 3143.7485 3160.6647 3167.9428 3194.6559 3196.3932 3576.0131
redmass: 4.4314 3.4878 3.1835 4.3822 3.8202 3.4872 2.9870 2.8707 3.6541 3.6332 3.1932 5.1423 3.9904 4.7491 4.0024 1.2042 4.5412 3.3180 3.4910 2.3113 2.9446 2.9581 3.1775 3.2487 2.9947 2.7315 2.4657 3.2287 3.5969 3.9338 2.2506 3.8208 3.4029 3.8266 3.8784 3.0525 2.9655 1.7801 2.8065 1.2509 2.2824 1.4797 1.4359 1.4507 1.3569 2.0456 2.0638 1.4276 1.4707 1.3643 2.9881 1.3500 2.7816 1.1519 1.1511 2.4579 1.4741 1.6911 1.5218 1.8025 1.2632 1.3618 1.6749 2.0295 1.4649 1.6882 2.2166 3.1733 1.3653 1.3714 1.2404 1.2620 1.5473 1.4736 4.8238 6.7395 2.9324 2.8245 1.2434 1.2360 1.1071 1.1067 2.5086 3.1278 7.2355 6.4915 6.6239 6.8001 4.6994 4.6909 1.0590 1.0591 1.0999 1.1001 1.0628 1.0646 1.0892 1.0907 1.0878 1.0896 1.0887 1.0943 1.0932 1.0947 1.0953 1.1143 1.1143 1.0661
irintensity: 0.8292 0.3341 0.4819 0.7811 0.1143 0.3154 0.3450 0.2208 0.1913 0.3506 0.4479 3.9074 2.9079 3.1721 3.4401 107.7222 9.6389 15.9537 0.8919 1.4759 1.4721 1.1332 10.1276 7.6341 0.7137 35.3168 0.2855 9.2880 10.3868 3.2159 11.5832 10.4111 8.6528 0.7464 6.0766 34.9632 8.3284 39.0826 28.6811 0.3350 47.4236 8.1814 23.5986 7.8689 1.0501 21.6377 6.5928 70.5408 64.7799 1.9772 38.3519 0.6390 9.8211 22.5702 26.2247 170.6292 16.0522 2.6165 5.7491 33.1889 39.1805 118.8922 51.3711 32.6499 69.7361 0.5929 161.1149 122.0887 70.6499 5.9830 2.3955 2.4574 6.0154 3.6347 5.6791 10.4622 18.7042 14.8614 7.0170 10.7991 29.7781 25.6940 202.0082 120.8020 7.6992 63.0528 14.9681 9.6176 22.1421 17.1014 40.6582 28.8527 14.6504 14.5391 17.0361 17.8851 6.6645 8.8023 17.7024 19.1888 11.6421 21.9824 0.6256 7.7481 4.8101 27.3470 24.7123 40.0932
temp: 298.150 k
press: 1.00000 atm
elementType: 8 8 6 6 6 6 6 6 6 6 6 6 6 6 6 6 6 6 6 6 1 1 1 1 1 1 1 1 1 1 1 1 1 1 1 1 1 1
symmnumber: 1
zpe: 799568.8 jmol-1
zpe.correction: 0.304540 hartree
zpe.thermalcorrener: 0.323966 hartree
zpe.thermalcorrenthalpy: 0.324910 hartree
zpe.thermalcorrgfe: 0.252608 hartree
zpe.sumelectzpe: -845.666801 hartree
zpe.sumelectthermal: -845.647375 hartree
zpe.sumelectthermalent: -845.646431 hartree
zpe.sumelectthermalfe: -845.718733 hartree
dipole: -1.6656 0.9322 -1.3142
dipole: 2.3174
quadrupole: -100.0056 -116.2530 -113.5193
quadrupole: 4.0627 7.3893 3.5600
quadrupole: 9.9204 -6.3270 -3.5933 4.0627 7.3893 3.5600
hfenergy: -845.971341 hartree
pointgroup: C01 [X(C18H18O2)]
dipole: -0.6689732 0.3712247 -0.4959169 debye
polarizability: 264.604298|16.6389217|204.4253647|9.6039411|-4.0751636|151.3645727 unknown
InChI: InChI=1S/C18H18O2/c1-3-5-14-7-10-16(11-8-14)20-18-13-15(6-4-2)9-12-17(18)19/h3-4,7-13,19H,1-2,5-6H2
charge 0 multiplicity 1
38 atoms
O  -0.640067 -1.700205 0.749106
O  -2.484156 -3.125681 -0.663137
C  -3.14633 1.020205 0.05111
C  -1.759051 -1.004532 0.237891
C  3.391683 -0.519335 0.080906
C  -1.965587 0.36733 0.484587
C  -3.376704 2.50072 0.361087
C  0.674773 -1.234602 0.498862
C  -4.121655 0.257752 -0.635728
C  -2.744685 -1.765023 -0.446926
C  4.859706 -0.164286 -0.165274
C  3.017514 -1.368127 1.153933
C  2.370238 -0.038182 -0.776988
C  1.671174 -1.728543 1.36873
C  1.017071 -0.388472 -0.581238
C  -3.926829 -1.119649 -0.878221
C  -2.17195 3.381221 0.0818
C  5.09428 1.304937 -0.467119
C  -1.576317 4.193973 0.990208
C  5.727104 1.782143 -1.568527
H  -1.196397 0.931931 1.023579
H  -4.236945 2.855822 -0.241861
H  -3.667656 2.622065 1.423852
H  -5.042994 0.739859 -0.982454
H  5.446325 -0.448342 0.732081
H  5.259877 -0.768693 -1.004247
H  3.788723 -1.752751 1.832621
H  2.639353 0.61933 -1.612125
H  1.376567 -2.386471 2.19159
H  0.244393 -0.017325 -1.261447
H  -4.69406 -1.695576 -1.412512
H  -1.774693 3.334115 -0.943788
H  4.711265 2.011626 0.285099
H  -3.242029 -3.547467 -1.140051
H  -0.712993 4.815235 0.727147
H  -1.936976 4.260654 2.024697
H  5.879677 2.856004 -1.724646
H  6.113952 1.109241 -2.344597
