program: Gaussian 09
title: 000159055
version: EM64L-G09RevD.01
frameworkgroup: C1[X(C10H16O)]
method: RPBEPBE
basis: SDD
operation: Freq
keyword: #pfreq=noraman
keyword: PBEPBE/SDD
title: #p freq=noraman PBEPBE/SDD
converged: YES YES NO NO
title: Mulliken charges:
elementType: O C C C C C C C C C C H H H H H H H H H H H H H H H H
charge: -0.183650 0.332883 0.239430 -0.201584 -0.537846 -0.482449 -0.561398 0.057830 -0.777848 -0.767498 -0.808349 0.247973 0.242717 0.239165 0.214530 0.235140 0.262940 0.238135 0.233844 0.216307 0.217390 0.215382 0.236018 0.216893 0.209661 0.238843 0.225543
chargesum: 0.00000
title: Mulliken charges with hydrogens summed into heavy atoms:
elementType: O C C C C C C C C C C
charge: -0.183650 0.332883 0.239430 0.046389 -0.055964 -0.032779 -0.060324 0.057830 -0.110307 -0.099205 -0.134302
polarizability: 1.06182484e+02 -1.43408337e+00 1.01130353e+02 4.31462918e-01 1.18289477e+00 9.74580204e+01
1716.lowfreq: -14.8331 -0.0006 -0.0005 -0.0002 17.5583 21.3114 101.6496 137.1393 146.0266
frequency: 101.5554 137.0829 145.9838 198.0459 206.8622 230.0521 253.6976 287.3512 287.7631 368.2846 382.5630 402.9235 464.0624 505.4976 541.8583 556.7020 594.9222 633.1974 694.3930 743.1818 825.9610 840.5495 857.3854 905.5935 922.6656 938.6322 944.2679 955.7223 990.0840 1012.1757 1025.6864 1038.1658 1076.9941 1089.4091 1121.3079 1149.4943 1167.1259 1191.2498 1197.9851 1220.0720 1236.6920 1239.5620 1265.5233 1291.3183 1299.0951 1316.5715 1380.8539 1388.5040 1401.2619 1432.0242 1459.2290 1462.5932 1467.7659 1475.1897 1478.1830 1489.6713 1492.2378 1506.8423 1661.2970 2976.1168 2979.2692 2982.0887 3002.9793 3009.6084 3017.1491 3054.1584 3057.8998 3058.9973 3064.2712 3065.5696 3074.2539 3077.0933 3079.0057 3080.3090 3092.2435
redmass: 3.8530 1.1045 1.0975 1.8373 1.3065 2.5441 2.4552 3.0574 1.9190 2.4577 2.3810 2.1701 3.3175 2.9129 4.0881 3.6303 2.9279 3.8983 3.0762 2.1646 1.4317 2.7376 2.2679 2.4857 1.6839 2.0585 1.3874 1.9957 1.4320 1.4795 2.0738 2.2990 1.3450 1.4658 1.9601 2.3734 1.7432 1.8782 1.7652 1.7800 1.4928 2.2652 2.1497 1.7095 1.5704 2.6534 1.2036 1.2426 1.1937 1.0828 1.0550 1.0486 1.0556 1.0537 1.0601 1.0615 1.0708 1.0742 11.7276 1.0368 1.0369 1.0365 1.0591 1.0612 1.0626 1.1017 1.0966 1.0952 1.1001 1.0991 1.0998 1.0982 1.1028 1.0987 1.0963
irintensity: 3.7801 0.2271 0.0544 0.1202 0.4396 0.9093 0.8958 2.3373 0.2676 1.0974 0.2616 1.0493 0.4293 4.5340 2.4049 0.9287 1.3269 1.0633 1.1478 11.1247 1.3581 1.7994 1.8531 1.2043 2.7985 4.8880 1.7673 6.9196 0.7841 16.6797 8.6400 28.8955 2.5290 8.2751 3.8931 0.8191 7.5751 1.8598 4.2744 2.8491 3.3673 0.3070 12.7659 2.8302 3.1646 7.8267 16.0128 16.5685 26.0030 20.7763 6.2797 7.6240 11.6323 6.9563 7.9474 0.8516 12.7293 7.4543 193.6042 21.2079 26.3113 41.6284 30.4693 11.8130 45.0494 7.5888 2.2803 20.2471 31.3384 47.1832 12.7584 11.3830 46.8781 66.7871 31.5410
temp: 298.150 k
press: 1.00000 atm
elementType: 8 6 6 6 6 6 6 6 6 6 6 1 1 1 1 1 1 1 1 1 1 1 1 1 1 1 1
symmnumber: 1
zpe: 619796.8 jmol-1
zpe.correction: 0.236068 hartree
zpe.thermalcorrener: 0.247170 hartree
zpe.thermalcorrenthalpy: 0.248114 hartree
zpe.thermalcorrgfe: 0.200790 hartree
zpe.sumelectzpe: -465.017632 hartree
zpe.sumelectthermal: -465.006530 hartree
zpe.sumelectthermalent: -465.005586 hartree
zpe.sumelectthermalfe: -465.052910 hartree
dipole: -3.3405 1.0108 -0.2065
dipole: 3.4962
quadrupole: -78.3985 -66.1631 -65.6009
quadrupole: 2.7037 -1.2958 0.4870
quadrupole: -8.3443 3.8911 4.4532 2.7037 -1.2958 0.4870
hfenergy: -465.2537002 hartree
pointgroup: C01 [X(C10H16O1)]
dipole: 1.3072163 -0.4237813 -0.0601555 debye
polarizability: 106.1347355|-1.5215949|101.1520019|-0.3328637|-1.2455144|97.4841195 unknown
InChI: InChI=1S/C10H16O/c1-9(2)7-4-5-10(9,3)8(11)6-7/h7H,4-6H2,1-3H3
charge 0 multiplicity 1
27 atoms
O  -2.586054 0.426022 0.267791
C  0.982849 0.278259 0.4288
C  -0.225454 0.551057 -0.560483
C  0.621548 -1.246449 0.618967
C  -0.015573 -0.581303 -1.6453
C  0.608429 -1.779546 -0.846093
C  -0.859618 -1.190474 1.0851
C  -1.405647 0.00298 0.269682
C  2.3753 0.514839 -0.199023
C  0.906836 1.116264 1.729986
C  -0.432513 1.952468 -1.125267
H  1.290091 -1.800034 1.299171
H  0.664919 -0.205305 -2.430263
H  -0.967058 -0.845194 -2.140322
H  0.008307 -2.702582 -0.934934
H  1.627066 -2.015973 -1.199438
H  -0.971799 -0.986623 2.165448
H  -1.432549 -2.109999 0.868349
H  2.519814 -0.006856 -1.159498
H  3.166491 0.16763 0.492754
H  2.541525 1.593758 -0.376139
H  1.663534 0.767324 2.457771
H  -0.07979 1.078102 2.223456
H  1.122006 2.179399 1.514158
H  0.404576 2.245048 -1.785479
H  -1.368532 1.9976 -1.710554
H  -0.520904 2.703888 -0.319941
