program: Gaussian 09
title: 000159035
version: EM64L-G09RevD.01
frameworkgroup: C1[X(C13H15ClO7)]
method: RPBEPBE
basis: SDD
operation: Freq
keyword: #p
keyword: freq=noraman
keyword: PBEPBE/SDD
title: #p freq=noraman PBEPBE/SDD
converged: YES YES NO NO
title: Mulliken charges:
elementType: Cl O O O O O O O C C C C C C C C C C C C C H H H H H H H H H H H H H H H
charge: -0.066798 -0.251002 -0.260902 -0.461942 -0.448238 -0.470007 -0.475817 -0.166531 -0.147755 -0.096342 -0.155689 0.003148 -0.091539 0.153551 -0.345296 0.456403 -0.290044 -0.376757 -0.229844 -0.225224 -0.225510 0.223154 0.243367 0.245458 0.199389 0.242660 0.370627 0.366390 0.383359 0.269892 0.213355 0.401891 0.292409 0.255000 0.231867 0.233317
chargesum: 0.00000
title: Mulliken charges with hydrogens summed into heavy atoms:
elementType: Cl O O O O O O O C C C C C C C C C C C C C
charge: -0.066798 -0.251002 -0.260902 -0.091316 -0.081849 -0.086647 -0.073926 -0.166531 0.075399 0.147025 0.089769 0.202537 0.151121 0.153551 0.137951 0.456403 -0.290044 -0.084348 0.025156 0.006643 0.007807
polarizability: 2.21132614e+02 6.87666429e+00 1.92545190e+02 7.20631362e+00 1.03924014e+01 9.91387910e+01
1716.lowfreq: -7.7309 -1.7340 -0.0022 -0.0019 -0.0013 1.4097 6.4145 20.5527 26.2082
frequency: 4.0385 20.5327 26.1898 37.4645 60.4249 97.1360 99.2452 120.6411 138.2425 152.9609 173.9435 190.4490 229.5338 231.3486 260.1420 273.4769 284.2439 310.9685 358.3633 362.5932 377.2424 401.4718 416.0846 425.4164 435.4171 445.3703 475.9800 497.4075 504.6726 524.3493 540.8233 567.1001 585.6882 588.8707 614.3561 633.7348 678.5106 691.9576 700.1550 759.9521 808.5568 854.4888 869.5359 903.8499 934.6672 948.2699 964.5555 982.5627 989.7633 1000.8018 1009.1775 1015.2611 1026.2189 1038.0496 1046.4569 1060.3753 1061.3706 1075.6015 1088.7858 1122.4573 1139.5452 1170.0574 1179.0312 1203.4898 1213.3040 1217.1731 1224.0572 1229.1557 1254.0545 1267.7769 1274.9952 1293.7234 1302.8067 1309.3064 1321.2538 1338.1379 1356.8897 1381.1024 1384.7385 1400.3040 1415.8234 1425.7587 1459.8435 1470.1445 1576.2420 1612.2609 1703.9005 2901.4348 2911.6143 2945.9100 2952.4020 2992.9455 3005.9743 3040.7897 3136.6752 3154.3836 3171.3611 3179.3137 3490.4156 3519.4948 3539.6992 3557.5521
redmass: 7.1489 9.0214 9.3760 6.8215 5.4841 6.7338 6.0798 8.2390 7.4808 4.7241 4.9382 4.9430 3.5191 4.3425 5.1660 5.6490 6.1857 6.4043 6.1976 7.7745 4.1588 3.8088 4.0018 1.3860 3.0442 1.3027 6.3990 3.1867 3.5142 2.6045 1.5467 3.8489 3.4888 2.7386 2.0526 4.0954 5.1171 4.8797 3.5722 1.2271 4.2968 6.8177 1.2859 7.3960 6.2655 1.4111 5.9011 3.3366 1.7470 5.3014 1.7705 6.0616 4.6463 2.1803 2.9489 3.9239 2.5657 2.6637 2.7818 1.6612 3.5026 1.0630 1.3336 1.0878 1.9667 1.2845 1.2005 1.2078 1.2303 1.4562 1.5778 1.2878 1.1976 1.2088 1.2970 1.3616 1.8139 2.2783 2.3904 1.4658 1.8226 2.1103 1.4666 1.6298 6.2162 7.2012 9.8873 1.0827 1.0797 1.0656 1.0817 1.0850 1.0851 1.0946 1.0861 1.0918 1.0954 1.0982 1.0653 1.0642 1.0655 1.0656
irintensity: 1.2585 0.4049 2.6442 0.3551 0.8663 2.7416 3.2357 2.5767 0.9158 1.0021 5.9938 1.4754 5.9628 4.5420 8.9999 7.4315 1.8088 14.0913 3.9349 6.4420 4.5914 17.1681 15.9456 85.9043 12.1327 189.6957 11.3740 1.2715 1.0184 40.3521 90.4752 42.7832 36.5451 99.8141 91.9274 44.0021 8.7269 22.6010 5.7329 88.2559 3.7801 38.3145 0.8106 180.8186 5.2611 5.3811 4.3138 419.6919 145.5137 108.6776 13.9083 56.7636 51.1535 2.9333 47.2014 4.4358 46.2570 11.3008 92.4268 5.4510 174.0981 2.3236 12.5093 21.7737 3.9308 12.6128 17.0875 8.2632 10.3728 22.8199 16.5575 11.4968 40.0747 35.5871 56.5479 31.5806 7.6508 11.7479 2.6884 17.9745 31.0837 12.1291 37.3168 6.5209 12.4076 0.7004 211.8550 38.7440 26.2962 22.7229 27.2868 14.4992 68.1047 9.9780 3.7339 14.5293 5.4467 12.0452 93.4746 31.8743 20.1880 27.6410
temp: 298.150 k
press: 1.00000 atm
elementType: 17 8 8 8 8 8 8 8 6 6 6 6 6 6 6 6 6 6 6 6 6 1 1 1 1 1 1 1 1 1 1 1 1 1 1 1
symmnumber: 1
zpe: 704134.8 jmol-1
zpe.correction: 0.268191 hartree
zpe.thermalcorrener: 0.288774 hartree
zpe.thermalcorrenthalpy: 0.289718 hartree
zpe.thermalcorrgfe: 0.214756 hartree
zpe.sumelectzpe: -1489.381881 hartree
zpe.sumelectthermal: -1489.361298 hartree
zpe.sumelectthermalent: -1489.360354 hartree
zpe.sumelectthermalfe: -1489.435316 hartree
dipole: 3.6005 0.3888 0.6044
dipole: 3.6715
quadrupole: -100.1131 -129.7604 -130.6036
quadrupole: 16.4063 0.2088 2.5364
quadrupole: 20.0460 -9.6014 -10.4446 16.4063 0.2088 2.5364
hfenergy: -1489.650072 hartree
pointgroup: C01 [X(C13H15Cl1O7)]
dipole: 1.4264649 0.0023012 -0.227489 debye
polarizability: 222.3316703|-3.5514075|190.1304149|-7.5077335|14.59957|100.3545095 unknown
InChI: InChI=1S/C13H15ClO7/c14-7-4-2-1-3-6(7)5-20-13-10(17)8(15)9(16)11(21-13)12(18)19/h1-4,8-11,13,15-18H,5H2
charge 0 multiplicity 1
36 atoms
Cl -3.606708 -2.863157 -0.987412
O  1.307359 -0.664276 0.07555
O  -0.721085 0.502017 0.081315
O  3.385776 2.967139 0.152994
O  0.643886 2.951112 -0.632164
O  4.834041 0.582666 -0.457118
O  4.645786 -2.071692 0.099208
O  2.582882 -3.098556 0.406532
C  2.771665 1.755095 -0.392464
C  1.290281 1.811378 0.013048
C  3.48717 0.491058 0.104689
C  0.581225 0.534631 -0.460077
C  2.685243 -0.745716 -0.403472
C  3.225292 -2.091891 0.080871
C  -1.566307 -0.594881 -0.426827
C  -3.016691 -0.245948 -0.155953
C  -4.046013 -1.190543 -0.367834
C  -3.397936 1.039013 0.30542
C  -5.40391 -0.907688 -0.135815
C  -4.754262 1.350187 0.546691
C  -5.758422 0.379719 0.329059
H  2.842365 1.764503 -1.503804
H  1.211579 1.873075 1.117828
H  3.509344 0.474546 1.214448
H  0.577667 0.46589 -1.575478
H  2.733684 -0.747003 -1.519305
H  4.353525 2.934432 -0.061837
H  1.204093 3.747185 -0.435857
H  5.313475 -0.260603 -0.235129
H  -1.277751 -1.538422 0.070989
H  -1.392951 -0.723131 -1.517803
H  4.986729 -2.961111 0.387596
H  -2.608043 1.777128 0.468119
H  -6.163773 -1.673862 -0.31426
H  -5.025524 2.349375 0.903617
H  -6.811592 0.615031 0.515734
