program: Gaussian 09
title: 000159072
version: EM64L-G09RevD.01
frameworkgroup: C1[X(C21H28NO4)]
method: RPBEPBE
basis: SDD
operation: Freq
keyword: #p
keyword: freq=noraman
keyword: PBEPBE/SDD
title: #p freq=noraman PBEPBE/SDD
converged: NO YES NO NO
title: Mulliken charges:
elementType: O O O O N C C C C C C C C C C C C C C C C C C C C C H H H H H H H H H H H H H H H H H H H H H H H H H H H H
charge: -0.265979 -0.436016 -0.279029 -0.270968 -0.113130 -0.240855 -0.412175 0.348249 -0.565178 -0.646217 0.339090 -0.584168 -0.587960 -0.556941 0.587925 -0.527780 0.210128 0.171207 -0.567559 -0.421336 0.234029 -0.328182 0.191148 -0.492455 -0.531446 -0.500227 0.291897 0.286382 0.264531 0.265804 0.252732 0.237011 0.241855 0.259592 0.303938 0.259984 0.264858 0.266563 0.275415 0.290743 0.234149 0.234033 0.241081 0.264918 0.375204 0.227749 0.240956 0.254144 0.213487 0.226814 0.260618 0.253845 0.241095 0.216429
chargesum: 1.00000
title: Mulliken charges with hydrogens summed into heavy atoms:
elementType: O O O O N C C C C C C C C C C C C C C C C C C C C C
charge: -0.265979 -0.060812 -0.279029 -0.270968 -0.113130 0.051042 0.138738 0.348249 -0.046642 -0.167352 0.339090 0.239346 0.218876 -0.266198 0.587925 -0.293631 0.210128 0.171207 -0.333526 -0.180255 0.234029 -0.063264 0.191148 0.230395 0.169472 0.211142
polarizability: 2.96704885e+02 -2.13021265e+01 2.85077340e+02 -3.40875106e+01 -1.06640084e+01 1.77305507e+02
1716.lowfreq: -11.7820 -5.6467 -0.0003 0.0003 0.0004 3.7024 13.5209 24.5992 26.8948
frequency: 12.1901 24.1973 26.6240 33.2115 41.5556 57.3732 65.2497 96.6808 99.1740 120.4160 151.9079 153.8302 166.4775 181.3045 190.2065 199.1815 207.5186 214.2863 232.7344 242.9615 250.4023 270.9703 272.5666 285.3717 298.8422 314.3439 320.1357 343.2886 347.2686 355.5500 376.4894 396.2340 400.9836 423.4783 445.3671 447.9767 471.4158 474.6463 497.5326 518.1321 541.5846 554.7755 575.2200 612.0048 632.8996 644.1269 685.6882 706.0318 710.1411 714.5285 719.8572 734.1348 752.2861 767.4201 824.8168 831.5476 834.1136 852.8499 882.6216 895.7345 902.9350 920.2496 934.5444 945.7235 952.2793 960.2567 982.5903 997.0778 1008.2540 1034.8633 1053.7387 1091.9794 1099.4405 1107.6112 1107.8385 1111.0183 1115.1313 1123.3226 1147.5251 1148.8119 1151.0008 1152.6714 1161.2171 1170.3356 1180.7193 1189.8908 1204.5770 1222.6028 1228.9204 1236.0491 1268.4497 1273.4826 1275.6198 1287.8614 1291.3768 1302.0312 1312.0867 1326.5605 1347.7565 1374.9094 1385.1999 1398.6532 1407.7598 1412.6563 1419.7806 1433.8818 1444.0113 1446.6642 1447.2559 1454.9918 1456.4612 1457.7263 1459.7058 1461.1629 1462.3417 1467.2337 1469.0026 1469.8018 1473.8937 1479.8150 1485.4989 1498.7366 1502.9577 1518.8037 1581.8574 1588.7247 1607.9580 1618.9099 2959.3475 2976.5372 2994.7991 2999.7716 3007.4404 3010.7989 3023.6567 3026.0466 3029.1484 3039.0799 3049.5241 3067.1982 3105.1793 3106.7561 3107.3396 3119.8499 3122.8163 3131.7475 3132.7067 3135.7904 3139.9733 3140.3008 3144.6981 3153.9354 3158.0398 3160.8672 3174.9815 3580.0861
redmass: 4.7921 3.5077 3.8137 3.1645 2.8119 3.5625 3.9872 2.9252 2.7805 2.0255 1.6341 2.9725 2.7982 3.3439 2.4685 2.6358 2.2196 1.7239 1.6977 2.1714 1.5216 1.9242 1.8194 3.1124 3.6071 2.3931 3.9916 1.1964 2.8689 3.4301 3.8423 5.2865 3.3405 3.2693 4.0191 3.5199 3.3530 3.3916 3.1111 3.8766 6.2715 4.1320 4.7866 4.6273 4.1731 5.8318 4.6514 3.6230 5.0294 4.2782 5.6320 3.1377 2.7546 3.3183 1.4690 1.4563 1.7290 2.9647 1.4850 2.5506 2.6894 3.3582 2.5569 2.0496 2.1974 8.2515 2.3319 4.2828 2.8485 2.3039 1.8933 2.5019 1.2946 1.2415 1.2539 1.2577 1.8458 1.8243 1.3592 1.6235 1.3871 1.5139 1.7791 1.4778 1.2009 1.4827 1.5106 2.0028 2.2913 1.5106 1.6654 2.1046 1.8861 1.5077 1.6894 1.7415 1.9904 1.4443 1.7795 1.3127 4.6188 4.0556 2.3084 3.0454 1.1612 1.2126 1.1779 1.3550 1.3724 1.0725 1.0602 1.0535 1.1036 1.0548 1.0831 1.0504 1.0771 1.0575 1.0673 1.0610 1.0696 1.0683 2.7376 3.1561 7.3414 7.0611 6.1901 6.9298 1.0335 1.0646 1.0328 1.0585 1.0301 1.0852 1.0332 1.0395 1.0831 1.0679 1.1041 1.1029 1.0912 1.1055 1.0996 1.1034 1.0903 1.1049 1.0987 1.1045 1.0903 1.1054 1.1062 1.1037 1.1041 1.0921 1.0954 1.0663
irintensity: 0.4406 1.5110 0.7316 7.1148 5.1329 1.9270 1.0373 6.5172 3.5911 0.6149 1.7016 1.2384 0.6570 0.7946 5.1791 1.2587 1.0757 1.6343 1.6167 0.7347 2.7461 1.4102 0.4050 3.4444 4.1876 1.7455 0.3139 118.3820 5.6801 25.7559 3.3736 1.9630 4.5554 5.2707 6.5146 1.7349 4.5010 16.6435 0.1874 0.4787 3.4046 2.0571 5.9813 14.0052 11.5581 8.4396 10.4890 0.2459 6.0544 0.6194 1.4811 8.3951 6.8805 6.7771 44.0911 17.4276 34.6818 46.2799 19.6018 29.0085 4.3113 13.8745 8.9724 13.2295 8.2185 39.5175 44.1202 48.4289 6.9707 2.1597 12.3828 129.3654 4.3869 0.9271 1.8912 0.3255 65.6908 18.1565 22.6584 3.5006 6.9803 40.9286 38.0917 18.2045 0.1833 19.3049 1.0615 49.2348 119.1945 8.0973 55.0584 192.4756 113.4606 37.5359 42.5069 20.8001 103.6014 22.6589 35.8224 5.2607 25.9629 9.3182 21.6623 17.4256 15.3036 3.7068 19.8157 11.8782 3.2571 7.2026 19.7416 12.2212 20.3390 34.3601 1.2552 26.3842 73.5013 41.8273 10.3512 26.7712 19.5179 46.0105 153.9435 132.7816 23.4056 47.6934 31.3637 26.7396 50.2208 26.0483 64.9388 28.1746 55.7424 6.6025 2.9274 5.8842 9.2503 23.1057 44.0092 18.3460 11.1775 7.5157 36.5818 24.4494 15.0184 3.2119 12.1692 10.1794 10.3834 14.9185 12.8302 4.2104 0.6618 0.7146 1.6404 70.5431
temp: 298.150 k
press: 1.00000 atm
elementType: 8 8 8 8 7 6 6 6 6 6 6 6 6 6 6 6 6 6 6 6 6 6 6 6 6 6 1 1 1 1 1 1 1 1 1 1 1 1 1 1 1 1 1 1 1 1 1 1 1 1 1 1 1 1
symmnumber: 1
zpe: 1186178.9 jmol-1
zpe.correction: 0.451792 hartree
zpe.thermalcorrener: 0.478717 hartree
zpe.thermalcorrenthalpy: 0.479661 hartree
zpe.thermalcorrgfe: 0.393140 hartree
zpe.sumelectzpe: -1170.428071 hartree
zpe.sumelectthermal: -1170.401146 hartree
zpe.sumelectthermalent: -1170.400202 hartree
zpe.sumelectthermalfe: -1170.486724 hartree
dipole: 10.3873 -8.4218 3.0304
dipole: 13.7116
quadrupole: -90.5444 -91.6420 -142.9330
quadrupole: -8.4280 -15.6226 -7.1095
quadrupole: 17.8288 16.7311 -34.5599 -8.4280 -15.6226 -7.1095
hfenergy: -1170.8798631 hartree
pointgroup: C01 [X(C21H28N1O4)]
dipole: 3.548465 3.9448817 -0.9733635 debye
polarizability: 292.1754901|19.3248606|291.5297474|34.0677983|2.8090172|175.3824943 unknown
InChI: InChI=1S/C21H28NO4/c1-22(2)9-8-15-12-18(23)20(25-4)13-16(15)17(22)10-14-6-7-19(24-3)21(11-14)26-5/h6-7,11-13,17,23H,8-10H2,1-5H3
charge 1 multiplicity 1
54 atoms
O  0.88897 -2.984571 -1.389913
O  3.567327 -3.350385 -0.229198
O  -4.594793 0.514298 -0.719937
O  -4.397397 -1.959105 0.746917
N  1.879794 2.956292 -0.313021
C  0.874061 1.741036 -0.227879
C  2.911688 2.826164 0.825756
C  1.668115 0.441664 -0.290219
C  3.768276 1.559826 0.690565
C  -0.055356 1.829162 1.027876
C  2.980867 0.33455 0.240428
C  2.568373 2.939072 -1.676999
C  1.16638 4.296897 -0.177087
C  1.043194 -0.698579 -0.84029
C  -1.215309 0.843346 0.930297
C  3.608145 -0.932006 0.236491
C  1.663262 -1.968935 -0.848778
C  2.96868 -2.083586 -0.270702
C  -2.338885 1.143468 0.116367
C  -1.195886 -0.373519 1.646537
C  -3.42854 0.247325 0.010985
C  -2.267407 -1.28137 1.531496
C  -3.386041 -1.003641 0.714007
C  1.471475 -4.273196 -1.834626
C  -4.715372 1.814849 -1.382987
C  -5.24768 -2.222027 -0.4356
H  0.245174 1.850015 -1.13255
H  2.32831 2.820504 1.760103
H  3.531557 3.739356 0.806427
H  4.244793 1.381947 1.673357
H  4.601896 1.745103 -0.015894
H  -0.466905 2.850841 1.123148
H  0.531166 1.608719 1.937214
H  3.378104 3.685655 -1.679449
H  2.968963 1.936372 -1.873629
H  1.823303 3.193993 -2.44659
H  1.861713 5.094491 -0.482543
H  0.282193 4.305443 -0.833182
H  0.861679 4.462112 0.865047
H  0.035737 -0.642286 -1.263213
H  4.624354 -1.028256 0.643523
H  -2.38642 2.107358 -0.404713
H  -0.341739 -0.624846 2.284505
H  -2.267818 -2.231809 2.072688
H  4.454666 -3.320403 0.207497
H  2.315636 -4.104666 -2.5247
H  0.641566 -4.770305 -2.357668
H  1.807259 -4.871797 -0.975059
H  -3.939091 1.944222 -2.16273
H  -4.660079 2.643279 -0.65056
H  -5.709091 1.804613 -1.852965
H  -5.962213 -1.402304 -0.600836
H  -5.772685 -3.155915 -0.185389
H  -4.626473 -2.366463 -1.338327
