program: Gaussian 09
title: 000159027
version: EM64L-G09RevD.01
frameworkgroup: C1[X(C7H13NO)]
method: RPBEPBE
basis: SDD
operation: Freq
keyword: #p
keyword: freq=noraman
keyword: PBEPBE/SDD
title: #p freq=noraman PBEPBE/SDD
converged: YES YES NO NO
title: Mulliken charges:
elementType: O N C C C C C C C H H H H H H H H H H H H H
charge: -0.298019 -0.129931 -0.032172 -0.420820 -0.379202 -0.492981 0.185149 -0.725066 -0.624502 0.219051 0.204731 0.216446 0.210882 0.216979 0.246920 0.231133 0.222046 0.214462 0.210763 0.281803 0.222592 0.219736
chargesum: 0.00000
title: Mulliken charges with hydrogens summed into heavy atoms:
elementType: O N C C C C C C C
charge: -0.298019 -0.129931 0.186879 0.000358 0.048659 -0.014929 0.185149 -0.077795 0.099629
polarizability: 9.46445837e+01 3.42839345e+00 8.97654858e+01 3.85993869e-01 7.80286387e-01 6.29680526e+01
1716.lowfreq: -22.8926 -10.4882 -0.0007 -0.0007 0.0006 13.6593 84.6686 105.6818 146.2952
frequency: 84.5583 105.6705 146.2897 199.9850 210.4753 246.8963 260.6820 348.8732 378.4093 404.4150 447.4381 510.6422 561.8424 640.0275 722.5587 804.3623 868.4968 908.1454 938.7572 956.2412 1000.5328 1037.3508 1083.3271 1101.9732 1115.3639 1137.4932 1163.1522 1178.8679 1227.2614 1232.0344 1267.9395 1284.1208 1299.0642 1321.5621 1347.6172 1357.3277 1390.4948 1402.8913 1421.5629 1451.8356 1465.9664 1474.6756 1477.1017 1479.8765 1487.1494 1502.0063 1589.6173 2923.5214 2962.8058 2965.6549 2972.3764 2977.7915 2991.3017 2997.7929 3037.2013 3037.5774 3065.8845 3069.0029 3075.3261 3112.5519
redmass: 3.9492 2.2424 1.0723 1.2917 1.4846 2.7558 2.4247 2.9441 4.0275 3.8216 2.2820 2.8749 3.7032 3.8090 4.0543 1.9502 1.8261 1.6782 1.5266 1.5131 2.0465 1.8902 2.1560 1.6698 1.2648 2.7836 2.0494 1.4266 2.1533 1.8727 1.3418 1.4914 1.3213 1.4526 1.4838 1.8158 1.2578 1.2844 1.5715 1.1003 1.0783 1.0815 1.0592 1.0624 1.0511 1.2697 6.6062 1.0653 1.0387 1.0728 1.0404 1.0643 1.0667 1.0960 1.1011 1.0998 1.0990 1.0964 1.0992 1.0970
irintensity: 4.4941 0.7063 0.1287 0.6267 1.5217 5.5328 0.7950 6.3047 7.7266 3.7513 1.5446 3.5314 1.4488 6.3855 1.0109 1.0738 8.1834 0.3479 3.7368 4.4442 5.1717 28.2587 14.6927 0.5435 0.0428 6.5906 31.1049 8.2433 31.5537 13.6652 17.5329 31.4297 3.6911 0.2218 9.5079 17.5989 27.7047 15.1220 61.0645 8.0196 11.8842 1.8230 15.4692 17.9252 16.8204 14.8803 292.0822 51.3088 56.1254 27.5596 17.6403 57.1334 12.8178 53.4672 28.5374 52.0816 33.1048 35.4204 40.4919 2.0402
temp: 298.150 k
press: 1.00000 atm
elementType: 8 7 6 6 6 6 6 6 6 1 1 1 1 1 1 1 1 1 1 1 1 1
symmnumber: 1
zpe: 503817.6 jmol-1
zpe.correction: 0.191894 hartree
zpe.thermalcorrener: 0.201479 hartree
zpe.thermalcorrenthalpy: 0.202423 hartree
zpe.thermalcorrgfe: 0.157601 hartree
zpe.sumelectzpe: -403.808735 hartree
zpe.sumelectthermal: -403.799150 hartree
zpe.sumelectthermalent: -403.798206 hartree
zpe.sumelectthermalfe: -403.843028 hartree
dipole: 4.0994 2.0451 0.0653
dipole: 4.5816
quadrupole: -65.4159 -52.7185 -54.6927
quadrupole: -6.7303 -0.7158 0.0769
quadrupole: -7.8069 4.8905 2.9164 -6.7303 -0.7158 0.0769
hfenergy: -404.000629 hartree
pointgroup: C01 [X(C7H13N1O1)]
dipole: -1.6376394 0.7479798 -0.088694 debye
dipolederiv: -1.1762858 0.3763322 -0.0506729 0.1067603 -0.6913472 0.0238483 -0.0231507 0.0370375 -0.382606 -0.6938974 0.075633 -0.0287767 0.3169538 -1.0431244 0.0869501 0.0555813 -0.000274 -0.3033409 0.0446997 0.0157936 -0.0141307 0.0152812 0.0532372 -0.0030318 -0.0430485 0.0019316 0.1474816 0.0120694 0.0636018 -0.0220535 0.0402225 0.0232275 -0.0246427 0.0005585 -0.0053664 0.1446552 0.489616 -0.225069 0.0854453 -0.1403612 0.166647 0.0005758 0.0447889 -0.000393 0.3440265 -0.0817875 -0.1128209 0.0102356 -0.1434997 -0.1299558 0.012242 0.0614568 0.0421043 0.1435135 1.192367 -0.4433283 0.0336923 -0.40887 1.3740371 -0.0978011 -0.0218746 -0.106245 0.1235637 -0.0579336 0.0290029 -0.0228075 0.0034031 0.0472348 0.0072594 0.0107693 0.0050588 0.0941959 0.0580451 0.2776518 -0.0269034 0.1657515 0.3041953 -0.0036962 -0.0237242 0.0167894 0.2672421 0.0368148 0.0047538 -0.0462097 -0.0069283 0.0228121 0.0332858 -0.0139729 0.0207637 -0.175548 0.051554 0.0237399 -0.0046083 0.0382465 0.0589234 0.0631525 -0.0306399 -0.0022596 -0.1703911 -0.0887701 -0.1556953 0.0187502 -0.1303302 -0.0728014 0.0155488 0.0369826 0.0386877 0.0704538 -0.0560129 0.0583684 -0.0357098 0.0418945 0.0297954 0.0358348 -0.0968258 0.1159561 -0.1656422 0.0131743 0.0312065 -0.0097726 0.0670443 -0.138395 -0.0868713 0.0195704 -0.1268903 0.0029124 0.0003125 0.075199 0.0336213 0.0568312 -0.0317751 -0.0654356 0.0220707 -0.106855 0.0558484 0.0347582 -0.0383628 0.0093133 -0.0159672 0.0666089 0.0304659 -0.0197429 0.0793232 -0.1017968 -0.0606469 -0.0828717 0.0368337 -0.1485889 -0.0257913 0.0643092 0.0511682 0.0564385 0.0685855 0.0481588 0.0441027 0.0038057 0.1127361 -0.1259342 -0.0905138 0.0252999 -0.0951505 0.0479705 0.068552 0.004238 0.0260181 0.0126239 0.0867945 0.0087555 -0.0593563 0.0281388 -0.164082 -0.025343 -0.0294475 -0.0009237 0.1016223 0.1653878 0.0008927 -0.0145128 -0.002975 0.1252861 0.0910455 0.0178726 0.0720206 -0.0380065 -0.0900904 -0.096002 0.02231 -0.143197 -0.0581576 0.0995098 -0.0099007 -0.0671673 -0.0468191 -0.0496863 0.0848738 -0.0037079 0.147376 -0.1141709 unknown
polarizability: 94.8308821|-3.199783|89.4568236|1.2567947|-1.7294989|63.0904164 unknown
InChI: InChI=1S/C7H13NO/c1-6-3-4-7(9)8(2)5-6/h6H,3-5H2,1-2H3
charge 0 multiplicity 1
22 atoms
O  2.496307 -0.827669 0.151032
N  0.797755 0.762931 0.017645
C  -1.619965 0.072795 0.318829
C  -1.200067 -1.266581 -0.324249
C  -0.621743 1.164038 -0.119026
C  0.205206 -1.666019 0.164963
C  1.254944 -0.550417 0.098832
C  -3.060601 0.482376 -0.048571
C  1.780658 1.855724 -0.070044
H  -1.54968 -0.039091 1.421168
H  -1.204954 -1.157121 -1.42816
H  -1.929545 -2.061272 -0.077093
H  -0.825065 1.440118 -1.178609
H  -0.777306 2.080455 0.48552
H  0.617261 -2.514878 -0.408019
H  0.161245 -1.999244 1.221173
H  -3.785183 -0.269473 0.313459
H  -3.333713 1.456916 0.397978
H  -3.180169 0.56534 -1.145793
H  2.787564 1.415853 -0.003344
H  1.637036 2.57597 0.758177
H  1.680315 2.398547 -1.03057
