program: Gaussian 09
title: 000159017
version: EM64L-G09RevD.01
frameworkgroup: C1[X(C2H4Br2)]
method: RPBEPBE
basis: SDD
operation: Freq
keyword: #pfreq=noraman
keyword: PBEPBE/SDD
title: #p freq=noraman PBEPBE/SDD
converged: NO YES NO NO
title: Mulliken charges:
elementType: Br Br C C H H H H
charge: -0.003012 -0.003012 -0.602969 -0.602965 0.303009 0.303007 0.302970 0.302971
chargesum: 0.00000
title: Mulliken charges with hydrogens summed into heavy atoms:
elementType: Br Br C C
charge: -0.003012 -0.003012 0.003010 0.003013
polarizability: 1.00634927e+02 9.21364812e+00 3.15136139e+01 -1.20051085e-03 -1.45477600e-04 2.49319198e+01
1716.lowfreq: -11.7570 -8.4500 0.0004 0.0004 0.0005 13.0923 98.5490 166.1763 175.3979
frequency: 98.5490 166.1763 175.3979 545.8405 612.3349 765.8317 925.3302 1066.7997 1075.7347 1205.6085 1254.8114 1257.2504 1450.1385 1457.0245 3071.1906 3077.6685 3151.3421 3176.7102
redmass: 4.1017 4.9456 38.7615 7.8362 4.8313 1.0967 1.2617 4.7285 1.0252 1.1184 1.2188 1.1700 1.0986 1.1054 1.0587 1.0544 1.1118 1.1130
irintensity: 4.5141 10.1330 0.0000 92.9657 0.0000 12.6015 0.0001 0.0009 3.9001 45.8878 0.0001 0.0001 13.0371 0.0000 0.0001 11.2714 0.0000 5.2023
temp: 298.150 k
press: 1.00000 atm
elementType: 35 35 6 6 1 1 1 1
symmnumber: 1
zpe: 146744.3 jmol-1
zpe.correction: 0.055892 hartree
zpe.thermalcorrener: 0.061272 hartree
zpe.thermalcorrenthalpy: 0.062217 hartree
zpe.thermalcorrgfe: 0.024415 hartree
zpe.sumelectzpe: -105.198702 hartree
zpe.sumelectthermal: -105.193321 hartree
zpe.sumelectthermalent: -105.192377 hartree
zpe.sumelectthermalfe: -105.230178 hartree
dipole: 0.0000 0.0000 0.0048
dipole: 0.0048
quadrupole: -50.8798 -42.0758 -43.2314
quadrupole: 0.4582 0.0001 0.0000
quadrupole: -5.4841 3.3199 2.1643 0.4582 0.0001 0.0000
hfenergy: -105.2545935 hartree
pointgroup: C01 [X(C2H4Br2)]
dipole: 0.0000035 -0.000003 0.0018773 debye
dipolederiv: -0.7295395 -0.0142788 -0.0001518 -0.0441429 -0.1506534 -0.0000497 -0.0006866 -0.0000206 -0.1141416 -0.7294361 -0.0142693 0.0001334 -0.0441408 -0.1506519 0.0000491 0.0006652 0.0000201 -0.1141404 0.7926938 0.1681965 0.0004577 0.0562182 0.0931578 0.0005779 0.000697 0.0004171 0.0921569 0.792858 0.1682105 -0.0004357 0.0562465 0.0931644 -0.000575 -0.0006437 -0.0004078 0.0921563 -0.0316895 -0.077075 0.0371338 -0.0060882 0.0286793 0.0694424 -0.0091066 0.072553 0.0112068 -0.0317724 -0.0770819 -0.0371365 -0.0061218 0.0286742 -0.0694429 0.009028 -0.0725656 0.0112056 -0.0315211 -0.0768461 -0.0374074 -0.0059617 0.0288167 -0.0695029 0.0088603 -0.0728466 0.010777 -0.0315933 -0.0768558 0.0374063 -0.0060093 0.028813 0.069501 -0.0088135 0.0728503 0.0107794 unknown
polarizability: 99.6795653|12.2480396|32.468976|0.0011929|0.0001987|24.9319198 unknown
InChI: InChI=1S/C2H4Br2/c3-1-2-4/h1-2H2
charge 0 multiplicity 1
8 atoms
Br -2.37771 -0.135633 0.007976
Br 2.377662 0.135696 0.008048
C  -0.475118 0.592733 0.010389
C  0.475073 -0.59269 0.010405
H  -0.393496 1.20896 -0.89606
H  0.393466 -1.208915 -0.896047
H  -0.395748 1.207155 0.918289
H  0.395671 -1.207107 0.9183
