program: Gaussian 09
title: 000159002
version: EM64L-G09RevD.01
frameworkgroup: C1[X(C12H18N2)]
method: RPBEPBE
basis: SDD
operation: Freq
keyword: #pfreq=noraman
keyword: PBEPBE/SDD
title: #p freq=noraman PBEPBE/SDD
converged: YES YES NO NO
title: Mulliken charges:
elementType: N N C C C C C C C C C C C C H H H H H H H H H H H H H H H H H H
charge: -0.214906 -0.301951 -0.034013 -0.034104 -0.457255 -0.457421 -0.710119 -0.710570 0.461423 -0.371997 -0.371943 -0.244463 -0.244460 -0.274326 0.202004 0.202192 0.195487 0.213923 0.213973 0.195476 0.273305 0.239648 0.239444 0.205324 0.239424 0.239733 0.205410 0.222600 0.222735 0.215840 0.215834 0.223754
chargesum: 0.00000
title: Mulliken charges with hydrogens summed into heavy atoms:
elementType: N N C C C C C C C C C C C C
charge: -0.214906 -0.028646 0.167991 0.168088 -0.047845 -0.047972 -0.025703 -0.026003 0.461423 -0.149398 -0.149208 -0.028623 -0.028626 -0.050572
polarizability: 1.92965718e+02 -1.49673909e-03 1.42179319e+02 1.38454729e-01 9.63799324e-03 9.20766912e+01
1716.lowfreq: -8.7102 -0.0007 -0.0004 -0.0003 7.9445 16.7631 54.7868 76.2867 137.1161
frequency: 54.7113 76.2344 137.1158 140.9928 173.6111 212.4995 212.8683 251.3457 257.5391 313.5877 323.6580 336.0289 410.6536 410.8303 451.3341 466.6470 502.3472 533.1962 582.5734 617.0601 623.3165 684.4129 686.7210 751.4781 775.7525 802.1898 841.9746 846.5559 862.5986 901.0824 912.0522 948.5862 952.3078 967.1271 971.6533 974.4826 1004.0367 1035.1161 1043.2806 1082.2443 1092.2175 1096.0194 1128.1294 1144.6421 1150.1534 1172.8384 1195.8482 1211.7870 1252.8527 1276.1839 1285.8294 1306.6160 1325.0619 1329.5413 1332.0580 1360.8782 1364.9574 1374.5445 1380.9706 1381.7810 1400.9678 1437.9532 1448.1550 1454.5777 1465.7478 1465.9373 1474.6501 1477.3741 1491.1539 1493.9711 1574.5100 1617.0825 2860.6835 2865.0533 2981.9473 2982.8806 3004.3355 3006.9865 3045.4557 3049.1673 3074.6106 3077.8406 3099.2975 3103.5510 3119.3571 3126.1384 3154.8626 3163.7730 3172.1402 3468.2653
redmass: 3.2946 3.6941 3.1252 2.7698 2.7548 2.9174 1.1295 2.1603 1.4171 2.7001 3.8361 2.5805 2.9122 1.9860 3.1294 2.6977 2.5463 3.1342 3.3710 5.8931 2.2617 2.8009 1.8914 1.9142 2.2030 1.3050 2.4216 3.3239 1.5211 2.3232 1.5159 2.9229 1.3616 1.6547 1.3355 4.9146 1.5756 2.1291 1.8397 1.9932 1.8198 1.7736 2.5098 1.5415 1.8328 1.0625 3.8853 1.1958 1.5112 1.2715 1.4684 1.8564 1.2830 1.4582 1.3427 1.5401 1.6616 1.2182 3.0602 1.2274 1.3542 1.3226 2.6423 1.0714 1.1046 1.0593 1.0670 1.0537 1.5020 1.3942 5.7665 6.1840 1.0722 1.0695 1.0369 1.0377 1.0824 1.0845 1.0886 1.0903 1.0978 1.0969 1.1007 1.0999 1.0845 1.0893 1.0930 1.0924 1.0976 1.0756
irintensity: 0.1231 0.3011 2.5835 0.1864 0.1815 0.0032 0.0132 2.9617 0.0897 1.3905 4.8163 0.4708 0.1221 16.1916 1.3454 18.2793 35.1485 14.9214 0.0649 0.0540 53.6625 2.9811 58.5432 79.7635 37.1063 0.3566 2.0101 9.2592 4.8311 4.7349 0.0035 4.1641 0.0000 1.9487 1.1895 7.6179 35.5050 18.3668 9.5051 22.9908 0.9277 0.1555 5.7818 36.7089 17.0955 0.1997 34.6019 15.2451 37.3454 1.2062 34.9338 93.1230 5.6488 7.8890 4.5671 21.4940 54.7297 14.6262 4.1739 52.5478 3.3578 1.8614 0.0029 0.8282 18.1964 8.5919 0.5756 8.2669 99.0952 54.4698 10.7735 165.2185 32.3773 180.0306 22.8648 33.1982 34.2097 25.0059 42.4436 23.4442 61.0603 34.7724 5.6457 27.8932 7.7677 16.5202 44.8286 38.9697 0.8778 0.9750
temp: 298.150 k
press: 1.00000 atm
elementType: 7 7 6 6 6 6 6 6 6 6 6 6 6 6 1 1 1 1 1 1 1 1 1 1 1 1 1 1 1 1 1 1
symmnumber: 1
zpe: 732432.4 jmol-1
zpe.correction: 0.278969 hartree
zpe.thermalcorrener: 0.292038 hartree
zpe.thermalcorrenthalpy: 0.292982 hartree
zpe.thermalcorrgfe: 0.240286 hartree
zpe.sumelectzpe: -576.489494 hartree
zpe.sumelectthermal: -576.476425 hartree
zpe.sumelectthermalent: -576.475481 hartree
zpe.sumelectthermalfe: -576.528177 hartree
dipole: -2.7961 -0.0005 -0.7202
dipole: 2.8873
quadrupole: -79.4043 -77.4557 -90.7503
quadrupole: 0.0016 4.3380 0.0045
quadrupole: 3.1325 5.0810 -8.2135 0.0016 4.3380 0.0045
hfenergy: -576.768463 hartree
pointgroup: C01 [X(C12H18N2)]
dipole: -1.0968354 -0.0063569 0.2954971 debye
polarizability: 192.9501602|0.0350107|142.1554022|-1.2598765|1.0942949|92.1161657 unknown
InChI: InChI=1S/C12H18N2/c1-10-8-13-9-11(2)14(10)12-6-4-3-5-7-12/h3-7,10-11,13H,8-9H2,1-2H3
charge 0 multiplicity 1
32 atoms
N  -0.495661 -0.003684 0.258646
N  -3.33957 -0.004831 0.297274
C  -1.235107 1.28573 0.127222
C  -1.234574 -1.286554 0.072583
C  -2.627952 1.18747 0.792426
C  -2.628308 -1.217573 0.740367
C  -1.340025 1.782859 -1.339002
C  -1.338961 -1.720935 -1.413411
C  0.915346 -0.001401 0.153697
C  1.667792 1.218776 0.137077
C  1.668032 -1.219575 0.083614
C  3.076487 1.211848 0.099252
C  3.076732 -1.210597 0.04602
C  3.80389 0.001011 0.059204
H  -0.676837 2.036296 0.717825
H  -0.676047 -2.061239 0.630801
H  -2.488047 1.157678 1.902371
H  -3.203033 2.096363 0.540688
H  -3.202998 -2.114695 0.448494
H  -2.489588 -1.236519 1.85062
H  -4.338085 -0.009837 0.536026
H  -0.368288 1.69917 -1.855998
H  -2.089482 1.189799 -1.889603
H  -1.651636 2.844439 -1.363713
H  -2.090627 -1.107183 -1.937673
H  -0.368024 -1.612716 -1.927394
H  -1.647569 -2.781412 -1.483631
H  1.161777 2.187402 0.150307
H  1.162297 -2.187976 0.053713
H  3.608464 2.170794 0.094497
H  3.608938 -2.168256 -0.001271
H  4.898164 0.001849 0.027574
