program: Gaussian 09
title: 000158984
version: EM64L-G09RevD.01
frameworkgroup: C1[X(C8H9N5)]
method: RPBEPBE
basis: SDD
operation: Freq
keyword: #p
keyword: freq=noraman
keyword: PBEPBE/SDD
title: #p freq=noraman PBEPBE/SDD
converged: NO YES NO YES
title: Mulliken charges:
elementType: N N N N N C C C C C C C C H H H H H H H H H
charge: -0.176353 -0.217916 -0.082884 -0.106028 -0.097513 -0.365802 -0.436758 0.228541 -0.483413 0.236504 -0.259716 -0.241548 -0.206334 0.241749 0.238978 0.222285 0.239080 0.241842 0.216796 0.271977 0.267246 0.269266
chargesum: 0.00000
title: Mulliken charges with hydrogens summed into heavy atoms:
elementType: N N N N N C C C C C C C C
charge: -0.176353 -0.217916 -0.082884 -0.106028 -0.097513 0.114925 0.024607 0.228541 -0.024775 0.236504 0.012262 0.025697 0.062933
polarizability: 1.74789205e+02 8.79696415e+00 1.23305919e+02 -3.21551580e+00 2.58459887e+00 6.11537635e+01
1716.lowfreq: -7.1790 -5.2158 -0.0004 0.0005 0.0007 8.5111 77.1120 95.7032 152.5387
frequency: 77.0895 95.6996 152.5368 220.3394 253.2252 294.7095 311.4118 412.9610 429.6962 441.1051 475.0361 565.4627 592.9476 625.4663 639.2260 653.3590 703.0992 729.2220 787.6567 813.8668 855.3658 867.2867 878.4309 921.4682 952.0753 966.6319 970.4906 985.3928 1066.7619 1092.4633 1112.1686 1142.5805 1154.0862 1188.1272 1210.1992 1216.6101 1258.1279 1267.1467 1292.1276 1310.5456 1333.9746 1340.5837 1350.0090 1381.1295 1415.5344 1459.9636 1461.9698 1485.8579 1504.0190 1581.1396 1621.6000 2953.5933 2962.9875 3007.1757 3021.7755 3050.8987 3076.8506 3184.0149 3204.3773 3266.3420
redmass: 2.9900 4.6892 4.4094 3.1961 4.3021 2.2857 6.0408 7.4501 3.6779 4.7816 3.7585 7.1643 2.8034 4.0249 6.3128 4.3003 2.4908 2.0491 4.6422 1.5913 3.8634 2.3899 1.3836 5.9606 3.1057 6.9140 1.2657 3.3420 1.9698 1.7291 2.0655 3.0986 2.0530 1.3669 1.7244 2.3079 2.0641 1.7166 2.5085 1.7678 1.5779 2.1865 1.4342 1.8214 4.5596 1.1816 1.0914 1.2561 3.0804 7.6109 7.6803 1.0689 1.0597 1.0731 1.0904 1.0925 1.1045 1.0883 1.0997 1.0995
irintensity: 4.1435 0.2170 1.3292 9.2170 4.2521 16.5702 0.9830 0.9215 2.5392 1.0112 1.2723 4.0753 0.5919 2.2394 3.9162 11.6531 6.2372 30.2103 2.9229 52.2511 6.2112 6.9852 1.0020 11.8713 12.9718 5.4267 0.1168 3.8194 10.0644 1.6580 4.0254 46.7386 7.6259 4.2701 0.4689 24.6551 22.7703 14.7954 31.9991 22.1006 6.2445 1.0321 12.3688 9.5384 1.7659 6.6029 11.5708 1.5157 52.9720 104.0574 58.2429 48.0326 40.1099 10.6984 32.1834 51.4175 32.7588 2.3642 1.1807 1.2111
temp: 298.150 k
press: 1.00000 atm
elementType: 7 7 7 7 7 6 6 6 6 6 6 6 6 1 1 1 1 1 1 1 1 1
symmnumber: 1
zpe: 446482.2 jmol-1
zpe.correction: 0.170056 hartree
zpe.thermalcorrener: 0.179808 hartree
zpe.thermalcorrenthalpy: 0.180752 hartree
zpe.thermalcorrgfe: 0.134712 hartree
zpe.sumelectzpe: -582.991288 hartree
zpe.sumelectthermal: -582.981537 hartree
zpe.sumelectthermalent: -582.980593 hartree
zpe.sumelectthermalfe: -583.026632 hartree
dipole: 5.3885 -2.3571 0.1008
dipole: 5.8824
quadrupole: -97.6610 -68.1971 -76.4618
quadrupole: -12.5659 0.0741 0.9953
quadrupole: -16.8877 12.5762 4.3115 -12.5659 0.0741 0.9953
hfenergy: -583.1613445 hartree
pointgroup: C01 [X(C8H9N5)]
dipole: -2.0951795 -0.9824336 -0.0318683 debye
dipolederiv: -0.5712484 -0.0283378 0.0230292 0.5003948 -0.5632615 0.0272221 -0.010339 0.0142729 -0.158159 -0.0907479 -0.0052755 -0.0091542 -0.1889293 -0.1062595 -0.0189909 0.0102947 -0.0120097 0.0933613 -1.1134461 0.1401279 0.0311345 0.0849896 -0.3680731 -0.0724716 -0.055334 -0.0367689 -0.3810674 -0.1795572 0.047658 -0.0141985 -0.1349674 -0.1015781 -0.0066907 0.0129251 -0.0145934 -0.223057 -0.2749648 -0.0812581 0.0077412 0.2617676 -0.2601816 -0.0131358 -0.022401 0.0013602 -0.2434682 0.0847068 0.2216586 -0.0181022 0.2039675 0.4485648 -0.0190157 -0.0293661 -0.0533471 0.3054449 -0.0570745 0.0119939 0.0223315 -0.056598 -0.0277492 -0.052568 0.0364125 -0.036476 0.0913164 1.1317312 -0.3307445 -0.0603117 -0.4981517 0.523904 0.019095 -0.0294199 0.0101602 0.1372672 0.5115122 0.0685478 -0.0252761 0.2367581 0.1636336 0.0166941 0.0622058 0.0166777 0.2819182 0.2368416 0.0030346 -0.0053742 0.3890891 -0.0720523 0.0095506 -0.0486333 0.026656 0.0847886 -0.2090872 0.0402862 -0.0050023 -0.0354804 0.0116761 -0.0144803 0.0168823 -0.0158381 -0.1549408 0.1762563 -0.0361008 -0.0120609 -0.2658816 0.2661265 -0.0167492 0.0116312 -0.0300459 -0.0963694 0.1570373 0.0385548 0.0013095 -0.1079163 0.0213389 -0.0217789 0.0050557 -0.0107526 -0.0630551 0.036799 -0.0244595 -0.0279831 -0.0379571 -0.0411626 0.0487439 -0.0125557 0.1175337 -0.1054965 0.0130468 0.0948161 0.0853022 0.0237098 -0.046549 -0.054176 0.0655557 -0.0701226 0.0076853 0.003543 -0.103873 0.0013742 -0.16927 -0.1045149 0.0088925 0.0010395 0.018258 0.0969454 0.0602132 0.0237582 0.0281658 0.046545 0.072477 0.0587595 -0.020263 0.002395 -0.1249278 -0.1802434 0.0181832 -0.0411602 0.0090677 0.0471439 0.008788 -0.1181217 -0.0077637 0.0720118 0.0312456 -0.006438 -0.0041626 -0.1813789 0.0230576 0.055008 0.1001876 0.0424726 -0.1522784 0.078236 0.0643416 0.0001516 0.0028625 0.0191497 0.0095184 0.010295 0.0076478 0.1602038 0.0659852 -0.0744562 0.0096821 -0.0256572 0.0300037 0.0114126 0.0024448 0.0129697 0.1685611 0.0892153 -0.0820174 0.0125642 -0.0569639 0.0643059 0.0163723 0.0115036 0.0173142 0.2033156 unknown
polarizability: 175.2076956|-7.4689891|122.8457726|-3.1731722|-3.0660931|61.1954199 unknown
InChI: InChI=1S/C8H9N5/c1-4-9-7-2-3-8-11-10-6-13(8)12(7)5-1/h2-3,6H,1,4-5H2
charge 0 multiplicity 1
22 atoms
N  -0.501368 -0.391062 0.07039
N  0.897943 -0.481628 0.054423
N  -2.429725 1.073323 0.148601
N  3.035258 0.233531 -0.043574
N  3.030195 -1.174402 0.084482
C  -1.265089 -1.653156 0.013914
C  -2.704653 -1.357739 -0.457075
C  -1.126541 0.897325 0.052252
C  -3.273887 -0.135117 0.299541
C  1.732984 0.639633 -0.059236
C  -0.233515 2.057072 -0.081719
C  1.134401 1.946669 -0.140113
C  1.733491 -1.584441 0.146039
H  -1.266242 -2.137764 1.011365
H  -0.768082 -2.339757 -0.69925
H  -3.328149 -2.255103 -0.295653
H  -2.698754 -1.138879 -1.540573
H  -4.285459 0.10882 -0.068607
H  -3.377193 -0.374669 1.38005
H  -0.745053 3.020729 -0.124472
H  1.793549 2.811998 -0.234932
H  1.408089 -2.612384 0.264747
