program: Gaussian 09
title: 000158948
version: EM64L-G09RevD.01
frameworkgroup: C1[X(C10H20O3)]
method: RPBEPBE
basis: SDD
operation: Freq
keyword: #pfreq=noraman
keyword: PBEPBE/SDD
title: #p freq=noraman PBEPBE/SDD
converged: YES YES NO NO
title: Mulliken charges:
elementType: O O O C C C C C C C C C C H H H H H H H H H H H H H H H H H H H H
charge: -0.458426 -0.318514 -0.215852 0.262765 -0.183902 0.243281 -0.735452 -0.735526 -0.722847 -0.724600 -0.730918 0.175784 -0.497399 0.222361 0.209743 0.213321 0.243693 0.221726 0.230680 0.215713 0.192851 0.221264 0.250364 0.202582 0.229612 0.227989 0.235192 0.210496 0.230340 0.359109 0.245389 0.232079 0.247104
chargesum: 0.00000
title: Mulliken charges with hydrogens summed into heavy atoms:
elementType: O O O C C C C C C C C C C
charge: -0.099318 -0.318514 -0.215852 0.262765 0.038459 0.243281 -0.068695 -0.067407 -0.058369 -0.064417 -0.054890 0.175784 0.227173
polarizability: 1.27948939e+02 1.13168752e+00 1.17683315e+02 -1.50552312e+00 -6.48967884e-01 1.08748671e+02
1716.lowfreq: -16.7749 -0.0012 -0.0010 -0.0009 6.9394 9.1828 67.4060 71.5919 85.6359
frequency: 67.3631 71.5374 85.6063 96.0922 113.5710 164.5712 186.3392 203.5897 214.8817 229.8507 247.5948 256.9361 274.1342 284.5831 292.4531 304.9554 313.6553 331.7078 351.0729 379.7817 402.8344 410.7152 443.2402 468.2642 520.7845 562.2581 668.1322 703.1521 747.4323 785.2628 798.4971 864.7403 909.1897 919.8264 921.4289 930.3470 944.9780 950.7403 966.3181 998.6181 1025.4687 1030.6774 1111.1679 1112.7809 1137.0571 1146.7375 1148.8729 1192.1147 1206.6810 1221.7632 1231.3503 1273.8017 1308.8018 1367.1682 1376.4830 1377.4970 1383.3164 1392.6164 1408.1248 1421.8916 1446.1470 1450.9244 1454.7013 1463.2034 1465.1158 1466.9824 1470.7627 1472.4617 1479.6342 1485.7850 1497.9789 1501.2600 1644.8348 2972.8863 2978.3810 2979.4912 2982.9568 2996.9335 3007.8249 3010.3344 3061.5639 3066.5202 3071.6756 3073.0649 3076.9747 3087.2085 3095.3373 3109.3378 3111.4489 3112.6578 3117.9869 3149.9663 3451.1623
redmass: 2.8972 2.7901 1.5944 2.4098 2.9232 2.4944 2.0320 1.2771 1.6614 2.7510 1.2526 1.4138 2.4789 1.9474 1.8605 1.3687 2.8461 2.3687 3.9603 2.3854 2.3656 2.6593 3.3232 2.1303 1.1891 2.5958 6.7544 4.9128 5.5255 3.5499 4.6493 2.4158 2.0753 1.7664 1.8684 1.7160 1.3870 1.5849 4.6785 1.4530 1.4223 1.4891 2.8359 1.2821 1.9184 2.0178 1.5164 2.8096 2.5062 2.7951 2.9504 1.3159 1.4895 1.2702 1.2766 1.3028 1.1954 1.2356 1.1981 1.1738 1.0521 1.0505 1.0517 1.0594 1.0515 1.0514 1.0502 1.0642 1.0523 1.0584 1.0536 1.0555 9.2501 1.0350 1.0383 1.0358 1.0391 1.0369 1.0300 1.0816 1.0990 1.0989 1.0980 1.0988 1.0996 1.1003 1.0992 1.0975 1.0981 1.1047 1.0957 1.1054 1.0651
irintensity: 1.3949 2.4629 0.9934 0.2197 0.2102 0.2625 1.0620 0.9183 0.6262 2.9222 0.5251 1.0241 2.9132 2.0623 3.3312 0.0701 5.1240 0.9372 3.4523 2.8744 0.3442 0.6814 10.8672 19.9929 120.3645 21.5017 3.0055 4.5133 18.0517 8.0999 1.1243 9.1157 20.8185 1.6191 3.2228 7.5293 0.6591 0.5600 44.8400 23.0685 15.5253 10.0242 45.5453 3.2080 19.8920 65.8672 21.5004 55.0302 64.3219 35.6372 40.6404 16.8816 2.7989 29.8266 6.1426 53.7058 34.5902 36.3721 14.5092 27.3811 3.7125 12.6513 0.7236 2.7779 8.8302 5.5373 9.4162 4.1201 9.2052 0.2826 17.6392 22.0090 157.9998 23.1000 32.4403 22.0393 35.2904 17.7737 34.4351 6.6814 16.2943 3.1054 42.0744 63.9268 48.1738 7.2556 53.2119 6.4922 30.3056 30.0860 23.9261 12.3139 74.5252
temp: 298.150 k
press: 1.00000 atm
elementType: 8 8 8 6 6 6 6 6 6 6 6 6 6 1 1 1 1 1 1 1 1 1 1 1 1 1 1 1 1 1 1 1 1
symmnumber: 1
zpe: 748114.1 jmol-1
zpe.correction: 0.284942 hartree
zpe.thermalcorrener: 0.301393 hartree
zpe.thermalcorrenthalpy: 0.302337 hartree
zpe.thermalcorrgfe: 0.243198 hartree
zpe.sumelectzpe: -617.649360 hartree
zpe.sumelectthermal: -617.632909 hartree
zpe.sumelectthermalent: -617.631965 hartree
zpe.sumelectthermalfe: -617.691104 hartree
dipole: -0.7355 -0.7686 0.2879
dipole: 1.1021
quadrupole: -73.5190 -82.2243 -88.0062
quadrupole: -1.5777 -9.1320 -5.4559
quadrupole: 7.7309 -0.9745 -6.7564 -1.5777 -9.1320 -5.4559
hfenergy: -617.9343019 hartree
pointgroup: C01 [X(C10H20O3)]
dipole: -0.3087657 0.271828 -0.1369956 debye
polarizability: 127.7554094|-0.0587776|117.5548312|2.9052168|-0.5564964|109.0706844 unknown
InChI: InChI=1S/C10H20O3/c1-9(2,3)7(8(11)13-6)10(4,5)12/h7,12H,1-6H3
charge 0 multiplicity 1
33 atoms
O  0.516792 -1.611012 -1.403791
O  -1.712534 -0.106669 -0.837578
O  -2.009836 0.332663 1.424332
C  0.964749 1.339998 -0.031752
C  0.297407 0.012091 0.549914
C  0.767751 -1.418768 0.038822
C  2.331984 1.586407 0.671436
C  0.056025 2.554485 0.331891
C  1.160692 1.324187 -1.570014
C  2.279432 -1.665899 0.201361
C  -0.009098 -2.508119 0.830951
C  -1.228039 0.1020 0.478739
C  -3.186567 -0.029661 -1.003537
H  0.504692 0.02593 1.638009
H  2.209966 1.641742 1.77022
H  2.749043 2.553165 0.332007
H  3.076471 0.807594 0.446995
H  -0.904083 2.528105 -0.21591
H  -0.167512 2.591722 1.414054
H  0.569284 3.493269 0.053372
H  1.618209 2.282733 -1.883083
H  0.195364 1.218916 -2.096079
H  1.809074 0.497513 -1.899933
H  2.617356 -1.469231 1.234134
H  2.858599 -1.044056 -0.498433
H  2.4905 -2.721623 -0.043205
H  0.288661 -3.500002 0.450243
H  0.211762 -2.461937 1.913506
H  -1.102685 -2.412478 0.70134
H  -0.388858 -1.242925 -1.59837
H  -3.679993 -0.799085 -0.386841
H  -3.359979 -0.204403 -2.074657
H  -3.546127 0.966447 -0.697842
