program: Gaussian 09
title: 000158928
version: EM64L-G09RevD.01
frameworkgroup: C1[X(C15H10N2O2)]
method: RPBEPBE
basis: SDD
operation: Freq
keyword: #p
keyword: freq=noraman
keyword: PBEPBE/SDD
title: #p freq=noraman PBEPBE/SDD
converged: NO NO NO NO
title: Mulliken charges:
elementType: O O N N C C C C C C C C C C C C C C C H H H H H H H H H H
charge: -0.258387 -0.239542 -0.296825 -0.002032 0.079689 0.289327 0.230225 0.231961 0.005218 -0.547141 0.073542 -0.334841 -0.315099 -0.195921 0.316161 -0.296650 -0.336341 -0.382282 -0.536764 0.256701 0.304430 0.241060 0.265711 0.251289 0.258429 0.244085 0.221813 0.221814 0.250373
chargesum: 0.00000
title: Mulliken charges with hydrogens summed into heavy atoms:
elementType: O O N N C C C C C C C C C C C C C C C
charge: -0.258387 -0.239542 -0.296825 -0.002032 0.079689 0.289327 0.230225 0.231961 0.005218 -0.290440 0.073542 -0.030411 -0.074040 0.069790 0.316161 -0.045361 -0.077912 -0.138197 0.157235
polarizability: 2.78921269e+02 -3.22945097e-01 2.33511846e+02 8.23225231e-04 5.68828288e-03 7.33132322e+01
1716.lowfreq: -0.8401 -0.0006 -0.0005 0.0004 4.8479 11.0429 55.9073 90.1384 113.7779
frequency: 55.8402 90.1296 113.7752 132.1198 137.3348 186.7302 212.8564 221.8941 265.6894 310.2399 311.5188 361.4725 375.0572 434.1723 448.0573 450.0770 467.2312 481.8647 544.1030 545.3626 566.6561 602.3336 606.3008 635.5196 651.3859 689.0111 694.8273 743.2539 760.0592 797.6916 828.1588 833.6966 844.0654 852.6153 866.9404 884.4523 947.2521 956.7206 977.0216 984.7248 987.8685 996.7838 1044.3579 1085.2861 1100.8100 1114.7607 1131.5333 1157.4341 1196.5595 1214.4841 1241.9032 1264.9863 1285.1828 1289.4287 1317.1094 1332.7121 1381.4660 1386.0361 1415.4684 1431.9789 1439.9188 1460.6831 1467.3764 1477.2643 1480.0611 1548.0160 1575.7359 1584.9498 1597.3555 1624.4909 1632.1321 2954.4727 3039.9132 3125.5841 3138.0965 3153.8681 3160.9170 3162.2849 3166.7027 3179.5617 3192.1188
redmass: 3.7648 5.4002 7.4355 5.0407 4.0979 3.5698 4.5784 2.1483 1.7490 5.2321 5.9984 4.6277 8.5209 5.0388 3.4052 8.2968 5.7148 5.5436 3.1039 4.9939 6.7059 4.2031 5.3919 4.2549 7.6822 7.0434 3.8295 6.9231 3.6433 4.5934 6.3706 1.5182 1.4601 1.5240 1.8905 6.6236 6.8024 1.4102 1.3278 1.3008 6.2809 3.5342 2.0884 1.8703 2.6583 1.2613 1.3689 1.3861 2.1065 2.6554 1.9658 1.9365 2.3128 3.2311 3.4148 5.6398 1.9457 5.3934 3.7186 1.8131 1.9546 2.5906 1.0497 1.1635 3.8910 7.4812 8.3860 8.8751 8.7372 8.0093 7.9762 1.0335 1.1036 1.0989 1.0884 1.0889 1.0934 1.0948 1.0899 1.0975 1.0969
irintensity: 1.7175 0.0579 4.7275 0.1419 1.8276 8.7751 6.2763 4.2860 0.4012 0.0023 0.9307 0.1018 0.5318 5.9601 1.3111 3.0141 11.1090 2.3914 5.9366 14.1176 5.5574 3.9880 0.3355 1.0658 22.0111 6.5579 2.1945 1.1355 0.0045 6.7918 5.5598 4.0759 29.5869 128.4224 0.1239 2.1910 1.5366 0.1566 1.4247 0.2642 15.4191 27.5354 25.2277 21.0363 15.6697 0.1561 61.9121 2.6312 121.7072 79.5530 5.0063 20.8568 74.8542 9.5474 5.5689 8.0872 24.7704 34.9670 31.6847 41.5053 21.6674 161.5563 14.3909 0.9991 106.3155 23.0500 105.2321 33.4091 93.7207 204.7862 13.9673 61.7010 48.8691 25.6808 9.7374 2.4305 4.6388 23.8618 2.4513 7.2720 1.9715
temp: 298.150 k
press: 1.00000 atm
elementType: 8 8 7 7 6 6 6 6 6 6 6 6 6 6 6 6 6 6 6 1 1 1 1 1 1 1 1 1 1
symmnumber: 1
zpe: 564672.5 jmol-1
zpe.correction: 0.215072 hartree
zpe.thermalcorrener: 0.229053 hartree
zpe.thermalcorrenthalpy: 0.229997 hartree
zpe.thermalcorrgfe: 0.174530 hartree
zpe.sumelectzpe: -836.271593 hartree
zpe.sumelectthermal: -836.257613 hartree
zpe.sumelectthermalent: -836.256669 hartree
zpe.sumelectthermalfe: -836.312136 hartree
dipole: 2.9511 4.0615 -0.0003
dipole: 5.0204
quadrupole: -97.5305 -110.0366 -112.6552
quadrupole: 11.4057 0.0001 0.0023
quadrupole: 9.2103 -3.2958 -5.9144 11.4057 0.0001 0.0023
hfenergy: -836.4866658 hartree
pointgroup: C01 [X(C15H10N2O2)]
dipole: -1.0957454 -1.6433685 -0.0001276 debye
polarizability: 278.8736057|1.5054491|233.5595094|-0.0005935|-0.0057168|73.3132322 unknown
InChI: InChI=1S/C15H10N2O2/c1-19-9-2-4-13-11(8-9)10-6-7-16-12-3-5-14(18)17(13)15(10)12/h2-8H,1H3
charge 0 multiplicity 1
29 atoms
O  -4.620106 -0.023734 0.000155
O  1.352922 3.250896 0.00012
N  0.908899 0.936411 -0.000168
N  3.120079 -2.047529 0.000116
C  1.392871 -0.370226 -0.000033
C  0.32716 -1.312326 0.00004
C  -0.909021 -0.517508 0.000039
C  -0.521238 0.866786 -0.00007
C  2.755459 -0.7211 0.000018
C  -2.276201 -0.871173 0.000109
C  1.790262 2.061735 -0.000351
C  -1.471522 1.905047 -0.000119
C  0.712183 -2.670066 0.000118
C  3.696346 0.387209 0.000098
C  -3.233225 0.173564 0.000079
C  3.224014 1.686641 0.000022
C  -2.831377 1.541505 -0.000034
C  2.108001 -2.969252 0.000142
C  -5.112914 -1.400182 0.000176
H  -2.576524 -1.922862 0.000189
H  -1.156722 2.95064 -0.000228
H  -0.016195 -3.487137 0.00017
H  4.768963 0.166908 0.000267
H  3.907255 2.541406 0.000154
H  -3.614598 2.30532 -0.000068
H  2.434437 -4.015101 0.000214
H  -4.781971 -1.948155 0.904876
H  -4.781959 -1.948185 -0.904498
H  -6.209477 -1.31603 0.000167
