program: Gaussian 09
title: 000158914
version: EM64L-G09RevD.01
frameworkgroup: C1[X(C14H14O6)]
method: RPBEPBE
basis: SDD
operation: Freq
keyword: #pfreq=noraman
keyword: PBEPBE/SDD
title: #p freq=noraman PBEPBE/SDD
converged: YES YES NO NO
title: Mulliken charges:
elementType: O O O O O O C C C C C C C C C C C C C C H H H H H H H H H H H H H H
charge: -0.277483 -0.520428 -0.359430 -0.255312 -0.183994 -0.220974 0.158375 0.170135 0.384197 -0.194932 0.024948 0.180481 -0.605414 0.023654 -0.114998 -0.685206 0.254613 -0.481933 -0.530959 -0.495429 0.262039 0.299058 0.209358 0.252993 0.243083 0.277443 0.374786 0.392289 0.244389 0.231850 0.232957 0.246906 0.234442 0.228496
chargesum: 0.00000
title: Mulliken charges with hydrogens summed into heavy atoms:
elementType: O O O O O O C C C C C C C C C C C C C C
charge: -0.277483 -0.145642 0.032859 -0.255312 -0.183994 -0.220974 0.158375 0.170135 0.384197 0.067108 0.024948 0.180481 -0.306356 0.023654 -0.114998 0.020229 0.254613 -0.204490 0.178236 0.214415
polarizability: 2.71694475e+02 -7.61607709e+00 2.20442864e+02 -1.03802319e+00 -1.74308318e-01 8.87752724e+01
1716.lowfreq: -7.8350 -0.0008 -0.0007 -0.0006 2.4123 7.8146 17.6394 41.1610 49.1071
frequency: 17.5247 41.1440 49.0992 58.3932 76.5522 98.8877 137.1154 144.8274 165.5757 185.0580 197.3618 200.6980 230.2997 232.6647 250.7510 277.4927 299.2487 302.5439 336.6771 364.3930 367.7901 393.4897 401.2035 406.4770 429.9785 449.8290 458.8218 484.3026 494.1190 577.1526 587.8470 619.4948 623.7380 672.8101 714.0140 727.9019 781.8240 789.2040 809.8597 831.3367 852.7026 871.1382 892.1119 899.2605 934.5966 946.4235 997.0651 1050.6841 1059.6746 1077.9099 1097.8439 1102.7802 1113.7259 1129.6207 1148.1692 1162.3214 1189.2067 1207.9184 1220.5992 1278.2017 1293.2420 1307.4152 1341.2526 1360.7467 1375.1231 1384.0473 1403.3603 1431.8623 1440.0250 1444.7296 1452.5074 1454.6557 1463.9331 1468.0991 1473.3416 1474.8148 1506.7000 1520.0125 1535.2935 1577.3693 1606.8855 1615.4025 2975.3318 2978.9341 3005.5445 3031.2818 3038.7854 3069.2314 3076.4300 3103.3697 3117.3053 3131.3295 3131.8352 3169.9906 3170.8313 3608.7329
redmass: 3.3116 6.6899 3.5680 4.5405 6.8337 4.0984 4.3832 4.7056 3.0507 3.6687 3.1538 1.3476 3.4233 1.3220 1.1959 3.7506 6.5215 3.2722 1.7651 3.1672 7.2807 5.2521 4.2302 5.8090 5.5366 6.6379 6.2615 5.3474 7.6664 5.0574 4.5332 6.6624 6.3487 4.7883 4.9186 5.4804 7.6815 4.6342 3.0342 3.0132 1.3830 2.8078 1.5561 1.9629 7.9963 4.1821 2.2367 2.0568 4.9277 3.2670 2.8850 1.2404 1.2594 2.2322 1.4515 1.5166 1.5423 1.7326 2.1516 5.0441 3.5044 1.2138 3.3385 2.2780 2.5501 1.2101 4.7182 2.8992 1.2156 1.3951 1.0621 1.0577 1.0699 1.0498 1.0590 1.0839 3.0693 4.0609 7.9301 8.5709 4.3131 7.7030 1.0320 1.0375 1.0283 1.0776 1.0760 1.1046 1.0967 1.1005 1.1047 1.1061 1.1012 1.0916 1.0908 1.0665
irintensity: 10.1696 0.4107 1.0017 0.8243 0.2507 2.5522 4.4706 7.5717 2.3425 3.9205 1.2430 1.7052 8.7232 0.1924 0.4323 14.9661 4.9498 3.4159 96.9945 21.9428 2.0062 3.6773 18.0318 25.5402 15.0230 16.1442 5.5797 6.2054 1.4908 6.2174 4.3038 1.2938 3.0498 34.6203 1.8931 10.1137 10.7923 7.6912 4.7882 55.4595 113.6701 14.9180 0.9005 45.1034 1.4742 34.1232 30.5650 120.8306 152.7702 96.1489 40.9805 1.1780 0.1975 15.3023 4.5213 29.3729 71.3643 196.3344 45.4341 268.9974 219.6895 12.6634 74.1297 11.6761 87.9908 17.9084 31.3992 7.2030 15.6141 12.8831 46.4589 25.5417 10.6624 15.1730 40.7518 12.0335 11.7900 70.4465 453.6799 101.4157 152.4793 118.7977 52.8382 30.1877 62.7055 415.9336 347.9986 34.3547 70.9421 11.5376 31.2612 38.1247 17.1428 3.9755 2.3962 12.6040
temp: 298.150 k
press: 1.00000 atm
elementType: 8 8 8 8 8 8 6 6 6 6 6 6 6 6 6 6 6 6 6 6 1 1 1 1 1 1 1 1 1 1 1 1 1 1
symmnumber: 1
zpe: 670262.9 jmol-1
zpe.correction: 0.255290 hartree
zpe.thermalcorrener: 0.274821 hartree
zpe.thermalcorrenthalpy: 0.275765 hartree
zpe.thermalcorrgfe: 0.206511 hartree
zpe.sumelectzpe: -991.724015 hartree
zpe.sumelectthermal: -991.704484 hartree
zpe.sumelectthermalent: -991.703540 hartree
zpe.sumelectthermalfe: -991.772794 hartree
dipole: 4.7190 6.0245 0.1619
dipole: 7.6544
quadrupole: -81.4246 -123.2771 -116.9232
quadrupole: -4.9599 2.7628 -0.6180
quadrupole: 25.7837 -16.0688 -9.7149 -4.9599 2.7628 -0.6180
hfenergy: -991.9793049 hartree
pointgroup: C01 [X(C14H14O6)]
dipole: 1.8952061 -2.3402993 -0.006937 debye
polarizability: 271.1679376|8.1350504|220.2332506|-7.0668119|-8.1532265|89.5114227 unknown
InChI: InChI=1S/C14H14O6/c1-6(15)11-9(19-2)4-7-12(14(11)18)8(16)5-10(20-3)13(7)17/h4-6,15,18H,1-3H3
charge 0 multiplicity 1
34 atoms
O  2.603953 -2.155271 0.246369
O  3.958923 1.698124 0.657736
O  1.660852 2.559936 0.021509
O  -4.478938 0.246246 0.154481
O  -0.944872 3.356665 -0.132465
O  -2.490112 -1.912856 0.231838
C  2.124511 0.176981 0.148442
C  -0.217941 1.025189 0.080246
C  -0.665542 -0.32681 0.166918
C  3.632063 0.372734 0.046098
C  1.196424 1.266742 0.086069
C  1.625898 -1.148152 0.221465
C  0.240656 -1.405533 0.242503
C  -1.231494 2.119047 -0.009399
C  -2.121108 -0.692844 0.185487
C  4.125379 0.314453 -1.41579
C  -3.106076 0.432003 0.14352
C  -2.654162 1.729063 0.048226
C  2.148829 -3.545559 0.379626
C  -5.123775 -1.059414 0.423457
H  4.133355 -0.412481 0.638867
H  -0.17456 -2.414418 0.304797
H  5.223573 0.444968 -1.470805
H  3.883003 -0.671951 -1.846768
H  3.640036 1.095367 -2.026748
H  -3.375376 2.550954 -0.002003
H  4.915791 1.905766 0.531049
H  2.655758 2.546329 0.246646
H  3.069565 -4.146151 0.405811
H  1.528281 -3.845191 -0.485412
H  1.578075 -3.688802 1.315916
H  -4.910993 -1.780796 -0.38021
H  -4.788105 -1.479657 1.385649
H  -6.195868 -0.811482 0.459475
