program: Gaussian 09
title: 000158953
version: EM64L-G09RevD.01
frameworkgroup: C1[X(C6H12N3O6PS)]
method: RPBEPBE
basis: SDD
operation: Freq
keyword: #p
keyword: freq=noraman
keyword: PBEPBE/SDD
title: #p freq=noraman PBEPBE/SDD
converged: YES YES NO NO
title: Mulliken charges:
elementType: S P O O O O O O N N N C C C C C C H H H H H H H H H H H H
charge: 1.055449 1.323839 -0.487517 -0.511558 -0.614835 -0.462316 -0.467935 -0.221849 -0.294495 -0.011979 -0.366768 -0.068923 -0.626962 0.141090 -0.476008 -0.480068 -0.498458 0.268501 0.308502 0.264520 0.275712 0.234454 0.233903 0.247121 0.253006 0.232925 0.242583 0.253772 0.254294
chargesum: 0.00000
title: Mulliken charges with hydrogens summed into heavy atoms:
elementType: S P O O O O O O N N N C C C C C C
charge: 1.055449 1.323839 -0.487517 -0.511558 -0.614835 -0.462316 -0.467935 -0.221849 -0.294495 -0.011979 -0.366768 -0.068923 0.214562 0.141090 0.268061 0.252983 0.252191
polarizability: 2.06104393e+02 1.25384142e+00 1.93230733e+02 2.10318067e+00 1.68740804e+00 1.16631675e+02
1716.lowfreq: -7.8405 -3.4189 -0.0024 -0.0013 -0.0010 7.9191 15.2356 17.6337 49.7267
frequency: 13.9691 16.7376 49.6579 61.2409 75.7258 90.5066 91.2831 102.6416 118.2370 122.7915 128.1704 134.7220 155.0986 169.1549 176.6762 195.1030 207.0311 222.5751 240.7036 250.8061 267.3503 272.8083 323.9416 350.5188 357.5721 371.7827 381.9638 427.0400 450.7229 473.8420 513.9304 578.9178 616.9020 663.4563 676.0816 697.4778 711.0157 840.6212 876.7674 953.7110 954.9927 980.4846 982.7022 1002.1385 1031.7331 1110.5835 1112.7306 1113.9041 1116.4568 1129.4194 1131.5185 1133.4562 1153.9499 1253.6964 1307.8054 1405.0098 1423.1114 1427.6150 1433.0454 1440.2588 1447.1333 1451.5859 1458.7417 1460.6787 1463.4814 1473.3561 1476.4587 1478.0091 1530.9703 2965.0509 2988.0234 3001.5495 3011.0059 3069.8991 3090.1639 3090.8121 3114.7467 3116.7328 3133.4937 3140.2184 3157.9303
redmass: 4.1254 6.0771 5.1298 2.3826 4.3801 1.3495 1.4065 1.9731 4.4880 2.0874 3.3651 1.4780 7.6137 1.3206 4.0599 4.5232 5.7278 6.1821 5.7384 4.1894 7.5231 7.5658 8.9499 9.8850 10.7392 7.6271 6.4547 7.1557 11.3225 9.0897 6.3573 11.1590 9.9196 9.6727 11.2011 12.0569 8.5635 11.5654 10.9021 11.0228 11.3027 8.9387 20.6504 7.6474 12.3014 1.2220 1.2585 1.2360 1.3322 1.2938 1.4848 1.3642 1.4229 6.6479 6.5685 3.4794 1.1941 1.1230 1.4838 1.2082 1.0542 1.0491 1.0504 1.0524 1.0550 1.0528 1.0775 1.0563 5.1940 1.0350 1.0295 1.0285 1.0291 1.0990 1.1030 1.1054 1.1037 1.1051 1.1038 1.1070 1.1055
irintensity: 4.8748 1.4808 1.7348 1.9963 1.7274 0.8146 1.0546 1.1178 0.7516 1.0610 4.5943 0.5207 3.5905 1.9629 7.4521 21.4274 3.2652 3.4891 3.1771 20.8511 2.3270 6.0508 26.0263 12.4429 16.9304 1.8833 4.3744 11.9476 52.3527 91.1271 44.4936 16.7955 131.9601 1.2234 121.3568 5.7908 14.0815 90.0785 78.6128 116.6946 246.1344 34.3303 90.1141 41.4323 81.5665 5.0874 0.2719 1.6543 1.7425 0.8973 1.5428 0.4451 7.2249 469.4746 105.8010 147.8667 39.3309 6.4398 72.7698 36.3632 8.8643 18.3353 27.4234 14.4334 26.4282 25.6289 33.4971 19.9470 300.5570 35.6581 52.2834 43.4335 25.2853 24.5164 4.7727 21.6463 16.7049 16.6305 9.8876 9.9064 19.6390
temp: 298.150 k
press: 1.00000 atm
elementType: 16 15 8 8 8 8 8 8 7 7 7 6 6 6 6 6 6 1 1 1 1 1 1 1 1 1 1 1 1
symmnumber: 1
zpe: 521535.4 jmol-1
zpe.correction: 0.198642 hartree
zpe.thermalcorrener: 0.220315 hartree
zpe.thermalcorrenthalpy: 0.221259 hartree
zpe.thermalcorrgfe: 0.145407 hartree
zpe.sumelectzpe: -1589.128574 hartree
zpe.sumelectthermal: -1589.106901 hartree
zpe.sumelectthermalent: -1589.105957 hartree
zpe.sumelectthermalfe: -1589.181809 hartree
dipole: -2.0474 3.6744 2.1888
dipole: 4.7417
quadrupole: -115.3703 -103.7018 -122.6657
quadrupole: 10.7934 -12.0813 -1.3830
quadrupole: -1.4577 10.2108 -8.7531 10.7934 -12.0813 -1.3830
hfenergy: -1589.3272159 hartree
pointgroup: C01 [X(C6H12N3O6P1S1)]
dipole: 0.7865603 -1.67453 -0.2396742 debye
polarizability: 205.1327747|6.1554049|168.3528525|-7.9020111|35.4547993|142.4811738 unknown
InChI: InChI=1S/C6H12N3O6PS/c1-9-6(16(10,14-3)15-4)7-5(13-2)8-17(9,11)12/h1-4H3
charge 0 multiplicity 1
29 atoms
S  -2.27916 1.037563 0.844436
P  2.217091 0.588688 -0.566752
O  2.526207 -0.10888 -2.104174
O  2.753503 -0.557855 0.626352
O  2.840203 2.049249 -0.443086
O  -2.36626 0.709668 2.417018
O  -3.0357 2.340919 0.283246
O  -1.787011 -2.131992 -1.491767
N  -0.315192 1.365376 0.460578
N  -0.181785 -0.671057 -0.820524
N  -2.589573 -0.422171 -0.172847
C  0.32512 0.43009 -0.252576
C  0.170553 2.614029 1.065965
C  -1.513273 -0.99455 -0.769329
C  2.42185 -1.57233 -2.363133
C  4.14769 -0.437615 1.127952
C  -3.196926 -2.603573 -1.524454
H  -0.522062 3.431256 0.798752
H  1.17754 2.847405 0.671939
H  0.209815 2.512591 2.164474
H  1.376799 -1.823204 -2.596588
H  2.758789 -2.151735 -1.485926
H  3.086251 -1.744999 -3.223711
H  4.158938 -1.018548 2.061672
H  4.403581 0.618674 1.324145
H  4.85696 -0.868648 0.399491
H  -3.155534 -3.515216 -2.13561
H  -3.843852 -1.838805 -1.984628
H  -3.55146 -2.817431 -0.502913
