program: Gaussian 09
title: 000158932
version: EM64L-G09RevD.01
frameworkgroup: C1[X(C10H10O7S)]
method: RPBEPBE
basis: SDD
operation: Freq
keyword: #p
keyword: freq=noraman
keyword: PBEPBE/SDD
title: #p freq=noraman PBEPBE/SDD
converged: YES YES NO NO
title: Mulliken charges:
elementType: S O O O O O O O C C C C C C C C C C H H H H H H H H H H
charge: 0.994992 -0.234532 -0.242579 -0.590751 -0.413651 -0.526744 -0.425133 -0.248278 0.458257 0.063149 0.188504 -0.310889 -0.258619 -0.361785 -0.238159 -0.292507 -0.538937 0.157388 0.275535 0.241121 0.265082 0.262309 0.259194 0.235726 0.284989 0.232007 0.381781 0.382531
chargesum: 0.00000
title: Mulliken charges with hydrogens summed into heavy atoms:
elementType: S O O O O O O O C C C C C C C C C C
charge: 0.994992 -0.234532 -0.242579 -0.208970 -0.413651 -0.526744 -0.042602 -0.248278 0.458257 0.063149 0.188504 -0.035354 -0.017498 -0.096703 0.024150 -0.033314 0.213785 0.157388
polarizability: 2.87762866e+02 -3.49832655e+00 1.56744105e+02 7.00929774e+00 -1.00130622e+01 1.18628086e+02
1716.lowfreq: -9.5289 -6.1094 0.0023 0.0026 0.0027 3.1239 17.2857 24.6761 33.7501
frequency: 15.1828 24.6529 33.7136 57.1198 68.3418 85.7768 119.1713 122.3010 140.7755 162.5318 183.8104 192.1928 203.0845 217.3759 228.4963 263.3507 274.2824 288.4164 322.0069 326.6857 361.6698 385.7056 400.7855 443.9529 482.0798 490.6586 512.0645 531.6558 553.1566 595.8328 598.0338 635.5566 655.7953 686.8392 723.0389 796.6091 815.2608 840.9059 877.2690 884.2160 898.3833 929.0025 937.3554 968.0720 996.0906 1010.8538 1013.4403 1051.2969 1062.8505 1115.3190 1121.1245 1152.3651 1183.4881 1202.7095 1229.0099 1263.2215 1299.7890 1329.2930 1347.6435 1405.1247 1437.0635 1461.7632 1479.8758 1551.7541 1568.9605 1622.4763 1638.1553 1655.9570 2982.6692 3087.8640 3100.7860 3122.4662 3125.3638 3164.2359 3166.9004 3173.2000 3453.8565 3525.7371
redmass: 8.3815 6.9434 8.9562 6.1136 7.5081 5.3015 3.8496 6.1884 3.8991 4.7143 4.3229 3.5731 4.2895 1.8838 3.5460 4.7831 5.9646 4.8732 5.3150 3.3034 1.9180 4.2448 4.1695 6.4371 4.7962 6.9386 2.6038 9.6527 6.7355 1.4755 3.8132 5.4856 6.4531 3.4555 4.7803 5.1946 3.1579 1.8700 7.6939 2.1724 2.0567 7.1407 5.7685 3.1577 1.2741 1.2997 5.2045 2.2854 1.2664 1.2724 2.1028 1.4338 1.7454 1.9296 1.4603 2.6279 1.6383 1.5837 1.9834 2.3601 1.1361 1.0482 1.0575 8.0146 8.6351 7.8579 7.1202 5.7155 1.0298 1.1046 1.0901 1.1038 1.0890 1.0929 1.0963 1.0920 1.0660 1.0641
irintensity: 1.8857 0.1576 0.3192 3.2231 1.6403 3.0160 8.1028 0.7925 0.7788 0.4261 0.7581 5.7456 1.5419 4.9614 1.2350 3.7592 7.5127 16.1246 20.9081 2.7759 138.7740 16.7611 36.9241 63.1394 31.4103 68.7429 7.7362 99.8177 44.7553 121.9650 39.6140 6.8232 15.4875 51.9510 8.6131 4.0060 92.5366 51.4697 76.9140 61.7266 0.6702 73.8178 10.8201 16.4507 15.2784 51.2666 52.9531 514.7587 43.4387 2.0433 10.0567 13.8685 17.3167 1.4000 10.6378 26.7220 21.6273 18.9864 107.2343 35.1027 15.0627 12.1544 9.5128 138.8684 7.5548 409.6844 59.4896 45.7454 38.4715 13.3666 1.8828 13.6906 7.2245 6.6372 5.3074 2.1223 65.5265 61.9017
temp: 298.150 k
press: 1.00000 atm
elementType: 16 8 8 8 8 8 8 8 6 6 6 6 6 6 6 6 6 6 1 1 1 1 1 1 1 1 1 1
symmnumber: 1
zpe: 493076.0 jmol-1
zpe.correction: 0.187803 hartree
zpe.thermalcorrener: 0.207297 hartree
zpe.thermalcorrenthalpy: 0.208241 hartree
zpe.thermalcorrgfe: 0.137321 hartree
zpe.sumelectzpe: -1310.190159 hartree
zpe.sumelectthermal: -1310.170665 hartree
zpe.sumelectthermalent: -1310.169721 hartree
zpe.sumelectthermalfe: -1310.240641 hartree
dipole: -0.4861 1.2792 1.1013
dipole: 1.7565
quadrupole: -116.3456 -109.5517 -109.1982
quadrupole: 4.8219 3.9337 -7.9192
quadrupole: -4.6471 2.1468 2.5003 4.8219 3.9337 -7.9192
hfenergy: -1310.3779619 hartree
pointgroup: C01 [X(C10H10O7S1)]
dipole: 0.2481359 0.3470948 0.543631 debye
polarizability: 285.1227873|-22.0614543|124.2848421|-5.0450601|-13.6728861|153.7274277 unknown
InChI: InChI=1S/C10H10O7S/c1-16-10(17-18(14)15)6-7(2-4-8(10)11)3-5-9(12)13/h2-6,12,14H,1H3
charge 0 multiplicity 1
28 atoms
S  -3.478601 -0.345472 -1.070911
O  -2.726217 -0.598347 1.680349
O  -1.122201 1.898186 0.884212
O  -4.384954 1.255407 -0.966852
O  -1.659483 0.338373 -0.904322
O  -3.399328 -0.701025 -2.630771
O  5.297281 0.461168 -2.138791
O  5.632801 -0.854573 -0.244756
C  1.34303 -0.435719 0.632389
C  -0.987684 0.537631 0.38622
C  -1.479283 -0.498647 1.440358
C  0.475631 0.439198 0.018204
C  0.84341 -1.286902 1.726554
C  -0.471654 -1.305436 2.124946
C  2.770232 -0.547161 0.290012
C  3.403793 0.00862 -0.785755
C  -2.423738 2.332358 1.449799
C  4.853552 -0.196004 -0.978565
H  0.793674 1.143826 -0.7557
H  1.56898 -1.937685 2.231539
H  -0.825666 -1.960737 2.927088
H  3.395075 -1.149052 0.96658
H  2.889143 0.604166 -1.545801
H  -2.651614 1.807493 2.394746
H  -3.239168 2.16714 0.724797
H  -2.280666 3.407264 1.639369
H  -4.283256 1.721448 -1.849395
H  6.274614 0.306781 -2.246244
