program: Gaussian 09
title: 000158877
version: EM64L-G09RevD.01
frameworkgroup: C1[X(C17H17NO3)]
method: RPBEPBE
basis: SDD
operation: Freq
keyword: #p
keyword: freq=noraman
keyword: PBEPBE/SDD
title: #p freq=noraman PBEPBE/SDD
converged: YES YES NO NO
title: Mulliken charges:
elementType: O O O N C C C C C C C C C C C C C C C C C H H H H H H H H H H H H H H H H H
charge: -0.213091 -0.266388 -0.255602 0.024989 0.240204 0.002335 0.223995 0.081555 -0.095940 -0.380251 -0.493989 0.362140 -0.357170 -0.338317 -0.191091 -0.361598 -0.326653 0.398282 -0.522938 -0.779612 -0.788992 0.263784 0.287677 0.249705 0.255045 0.264092 0.212562 0.213433 0.235764 0.242428 0.231302 0.231106 0.223260 0.216933 0.234429 0.225961 0.226077 0.224577
chargesum: 0.00000
title: Mulliken charges with hydrogens summed into heavy atoms:
elementType: O O O N C C C C C C C C C C C C C C C C C
charge: -0.213091 -0.266388 -0.255602 0.024989 0.240204 0.002335 0.223995 0.081555 -0.095940 -0.116467 -0.206312 0.362140 -0.107465 -0.083273 0.073000 0.064398 -0.090889 0.398282 0.181898 -0.104991 -0.112378
polarizability: 3.79991557e+02 -1.46461906e+01 1.98973207e+02 -5.00511783e-01 1.09170198e-02 1.08604625e+02
1716.lowfreq: -5.7990 -0.0008 -0.0007 -0.0004 4.8634 6.7817 12.7729 25.3261 51.6790
frequency: 11.0828 25.1550 51.6268 65.5952 69.4909 105.9593 115.4916 123.6787 140.6328 173.0112 176.6970 213.9574 218.4861 234.0027 265.1132 272.2733 291.5579 320.7312 351.3589 357.9607 373.8246 396.9710 426.6676 453.8092 462.2928 495.4466 516.5566 555.5346 568.0827 606.9123 622.6672 631.7123 642.4351 707.7852 719.5002 737.7762 740.7714 776.5141 788.7085 820.7293 846.4644 851.3951 855.4328 888.1486 895.3980 921.8592 929.0863 947.4378 960.7305 977.9203 981.9242 993.6850 1009.6991 1044.0054 1050.7817 1083.5906 1113.9388 1116.0358 1139.4526 1141.4656 1149.7699 1168.2008 1187.0112 1188.6103 1238.8862 1241.1275 1252.8079 1287.9665 1323.2018 1330.8393 1340.0787 1373.6625 1389.1910 1399.4244 1400.7098 1425.5033 1447.6439 1454.0517 1457.3619 1462.3747 1470.8000 1471.8703 1471.8951 1476.5531 1480.8522 1502.8398 1531.5705 1561.6853 1608.0748 1632.1326 1700.8342 2949.3342 2963.2577 2969.6535 2979.5417 3025.3956 3036.4162 3040.9921 3078.8922 3085.9908 3093.0518 3113.0562 3130.8965 3154.4701 3175.7413 3184.5938 3236.1704 3266.1435
redmass: 3.4456 3.7772 3.4802 3.8085 3.2976 4.8114 1.1045 4.6325 2.8858 4.3969 1.3829 3.9831 2.9994 5.7736 1.1540 4.1311 2.4906 5.3394 4.5275 7.6724 2.9111 3.8860 4.3443 3.1433 2.5335 4.3685 6.7798 3.5694 4.1302 5.8691 5.2630 5.6474 7.2900 2.4416 8.2422 1.7819 7.0060 2.8669 2.2884 1.8729 6.5367 1.3483 1.9858 1.5723 4.0920 5.4836 6.9107 1.3943 1.3429 2.2474 2.0151 1.2603 4.2874 1.6957 4.3047 1.6926 1.2494 2.2823 2.3087 1.3943 2.1122 1.6830 1.4302 1.6067 2.8004 2.0307 2.2429 3.2678 2.2254 1.5708 2.4676 1.4504 1.3056 1.4260 3.1479 2.9655 1.5289 1.0520 1.8888 1.6480 1.0653 1.0757 1.0530 1.0484 1.1206 4.0930 5.4963 8.7607 11.0943 7.1792 6.4603 1.0600 1.0375 1.0385 1.0315 1.1008 1.0969 1.0962 1.1051 1.0987 1.0964 1.0900 1.1012 1.0866 1.0964 1.0926 1.0899 1.1080
irintensity: 0.4577 1.3375 0.9096 1.7646 1.8220 0.2864 0.1358 5.4135 0.5049 5.0008 1.4661 4.4807 1.2284 1.7018 0.1528 1.6750 0.5878 1.0377 8.0907 0.0568 0.2739 1.1504 7.8063 2.9924 4.0323 2.2189 3.9977 16.3839 12.5039 18.0398 2.8816 1.1737 7.0755 41.9811 2.0216 39.2438 6.0345 4.1726 15.0010 29.5536 0.5174 0.9452 6.8068 30.3578 11.8000 21.8575 178.7592 0.5166 1.8313 75.2554 38.4053 5.8292 10.0176 23.4621 90.4328 5.2843 0.0407 21.2524 50.1780 92.0812 249.7944 87.1264 15.0613 27.8390 96.0538 12.5839 155.2278 35.6728 86.7921 4.9632 76.1563 37.2659 26.5119 16.9652 51.5370 71.4290 86.0943 0.5146 19.2553 9.6666 21.5323 11.6996 17.2911 31.0230 29.5347 53.9316 54.9995 165.7412 115.1034 246.9405 26.1588 38.1136 33.9214 51.1458 53.8336 31.6639 5.7646 41.8821 33.9666 24.3806 37.2165 25.0233 21.0485 5.9127 12.8686 2.8662 7.0289 2.6265
temp: 298.150 k
press: 1.00000 atm
elementType: 8 8 8 7 6 6 6 6 6 6 6 6 6 6 6 6 6 6 6 6 6 1 1 1 1 1 1 1 1 1 1 1 1 1 1 1 1 1
symmnumber: 1
zpe: 785277.5 jmol-1
zpe.correction: 0.299096 hartree
zpe.thermalcorrener: 0.318763 hartree
zpe.thermalcorrenthalpy: 0.319707 hartree
zpe.thermalcorrgfe: 0.248931 hartree
zpe.sumelectzpe: -936.871784 hartree
zpe.sumelectthermal: -936.852117 hartree
zpe.sumelectthermalent: -936.851173 hartree
zpe.sumelectthermalfe: -936.921949 hartree
dipole: 0.2810 5.5444 0.1008
dipole: 5.5524
quadrupole: -72.3961 -124.4340 -125.5270
quadrupole: 9.8358 -0.7307 0.8612
quadrupole: 35.0563 -16.9817 -18.0746 9.8358 -0.7307 0.8612
hfenergy: -937.1708799 hartree
pointgroup: C01 [X(C17H17N1O3)]
dipole: -0.0434401 2.1838006 0.0332773 debye
polarizability: 380.718247|9.0778851|198.1446401|-0.7509014|2.9731263|108.7065026 unknown
InChI: InChI=1S/C17H17NO3/c1-11(2)6-8-20-12-4-5-13-15(10-12)18-17-14(7-9-21-17)16(13)19-3/h4-7,9-10H,8H2,1-3H3
charge 0 multiplicity 1
38 atoms
O  -4.134711 -2.232839 -0.116519
O  -2.854291 2.419221 0.300867
O  2.83111 -0.599379 0.388196
N  -1.805648 -1.746434 0.049763
C  -1.223352 0.67672 0.261829
C  -0.858131 -0.731298 0.177523
C  -2.615345 1.050514 0.212181
C  -3.581548 0.03068 0.08262
C  -3.05521 -1.319811 0.01171
C  -0.180784 1.645061 0.390674
C  0.514758 -1.099601 0.22834
C  1.513158 -0.124043 0.356472
C  1.161296 1.265503 0.438077
C  -5.033231 -0.100287 -0.008814
C  -5.307013 -1.443494 -0.123984
C  3.924844 0.389338 0.599146
C  5.20051 -0.39006 0.740041
C  6.33517 -0.257907 -0.005443
C  -4.233138 2.920411 0.268742
C  7.553466 -1.116396 0.292534
C  6.51561 0.713532 -1.158507
H  -0.455216 2.701806 0.451503
H  0.778913 -2.157606 0.1654
H  1.932635 2.03483 0.532123
H  -5.789412 0.67935 0.006631
H  -6.234875 -2.001201 -0.21806
H  3.95032 1.099397 -0.249083
H  3.705528 0.955241 1.529727
H  5.183652 -1.137096 1.545294
H  -4.139265 4.012287 0.359522
H  -4.817801 2.523843 1.118531
H  -4.724115 2.666268 -0.688109
H  7.82092 -1.733625 -0.587824
H  8.437652 -0.488184 0.519271
H  7.382129 -1.792223 1.147388
H  6.872435 0.174714 -2.057637
H  5.593347 1.251456 -1.431485
H  7.289132 1.468809 -0.915239
