program: Gaussian 09
title: 000158973
version: EM64L-G09RevD.01
frameworkgroup: C1[X(C20H24ClNO4)]
method: RPBEPBE
basis: SDD
operation: Freq
keyword: #p
keyword: freq=noraman
keyword: PBEPBE/SDD
title: #p freq=noraman PBEPBE/SDD
converged: YES YES NO NO
title: Mulliken charges:
elementType: Cl O O O O N C C C C C C C C C C C C C C C C C C C C H H H H H H H H H H H H H H H H H H H H H H H H
charge: -0.095431 -0.455757 -0.270399 -0.269391 -0.222915 -0.330865 0.016551 -0.602241 -0.401101 -0.251411 -0.705309 0.482549 0.513629 -0.415541 -0.390973 -0.350412 -0.458665 -0.372020 -0.356902 0.361659 -0.092447 -0.211327 -0.241591 -0.376215 0.253802 -0.500235 0.177062 0.214185 0.207253 0.290892 0.197243 0.198007 0.212196 0.214283 0.206317 0.226108 0.239024 0.230105 0.285092 0.243593 0.251905 0.241510 0.339113 0.234987 0.307146 0.246377 0.248852 0.237485 0.246757 0.247467
chargesum: 0.00000
title: Mulliken charges with hydrogens summed into heavy atoms:
elementType: Cl O O O O N C C C C C C C C C C C C C C C C C C C C
charge: -0.095431 -0.116645 -0.270399 -0.269391 -0.222915 -0.039973 0.193613 -0.180803 -0.005851 -0.039215 -0.058601 0.482549 0.513629 -0.176517 -0.160868 -0.065320 -0.215072 -0.120114 -0.115391 0.361659 -0.092447 0.023660 0.065554 0.119014 0.253802 0.231474
polarizability: 3.25616148e+02 1.23697673e+01 1.75386420e+02 -5.65964255e+00 -9.60311601e+00 2.11707799e+02
1716.lowfreq: -4.6403 0.0001 0.0012 0.0018 4.3979 7.0561 17.9347 25.1480 30.3240
frequency: 17.7901 25.0650 30.3117 35.3352 47.3500 50.8652 57.9851 72.3298 86.1351 93.0195 98.3282 111.6043 135.0715 141.5318 152.2795 171.9088 179.4228 191.3120 209.1477 219.8634 238.2477 242.2333 271.5036 290.5921 299.6328 304.0560 330.9758 353.2325 364.4125 381.5634 392.0474 410.7700 429.4934 445.0661 464.1629 475.8378 506.8006 521.8614 561.4467 587.1060 589.4310 590.3705 633.7566 661.5213 674.1983 696.3341 708.6375 722.4679 756.2542 797.4749 801.3225 809.9921 820.6392 830.0317 854.2762 865.2450 894.5856 899.8635 920.7528 931.6134 941.0568 945.6633 963.8117 977.0349 982.6822 983.9117 989.8220 998.5819 1004.2124 1024.0457 1049.0578 1063.7410 1067.1932 1092.9270 1099.8736 1114.9020 1121.3256 1124.8662 1141.3937 1150.8087 1156.3884 1165.7387 1179.9555 1183.0921 1193.0194 1210.0436 1214.1077 1226.0059 1229.4581 1231.5708 1278.3452 1285.6329 1288.0681 1304.0282 1320.7086 1341.2152 1355.1040 1361.5016 1374.7713 1381.1632 1384.6189 1397.6992 1416.5538 1423.8014 1430.4251 1453.5198 1456.0552 1457.1885 1463.7853 1465.6342 1466.2089 1475.9552 1476.6750 1485.5020 1500.2898 1576.7332 1584.7015 1609.1360 1621.8865 1664.1586 2829.9925 2860.7165 2966.0897 2971.8930 2979.5041 2986.3900 2987.9849 3008.6504 3046.0013 3047.6363 3072.8827 3085.2103 3112.5838 3119.1493 3126.0571 3130.1965 3149.1527 3154.9771 3155.1088 3165.1786 3166.4723 3172.9370 3403.0079 3552.8092
redmass: 6.2381 5.5331 5.7994 6.5421 6.5329 6.6097 4.6400 3.7703 1.8469 2.1158 2.4372 4.1561 4.0810 5.5444 2.7976 4.9566 3.4571 4.2467 3.0433 1.4286 3.1203 3.2543 2.4919 1.5610 4.4605 3.6021 3.4138 3.7480 3.9996 10.9897 3.8772 2.9696 3.8516 3.1389 3.2965 2.9442 3.3077 3.3345 3.5686 3.6264 4.2401 5.2813 6.7331 6.3113 4.8473 2.1811 2.3080 1.9538 4.3219 1.4206 2.4026 2.6285 2.0431 1.8521 2.1495 5.0429 1.4732 1.5749 1.3745 1.5737 1.6546 5.0279 1.3611 3.1737 3.8170 1.6152 2.4602 2.6768 2.7050 3.5737 2.4129 1.8224 2.0705 2.2241 1.7503 1.2736 1.7299 1.6968 2.5228 1.4940 1.5338 2.8793 1.1907 1.0972 1.2190 1.4961 1.8290 1.8043 1.4757 2.3169 1.1780 1.2993 1.3462 1.2884 1.2780 1.5469 1.4583 1.5814 3.4707 1.4965 2.6282 1.8320 3.2001 1.1932 2.2784 1.0495 1.1164 1.0891 1.0505 2.1850 1.1093 1.1345 1.1318 1.1203 2.4676 6.3160 7.0001 6.8444 6.4763 9.7630 1.0810 1.0691 1.0593 1.0821 1.0398 1.0748 1.0724 1.0295 1.1020 1.1008 1.0987 1.1002 1.1049 1.0887 1.0892 1.0878 1.0925 1.0942 1.1050 1.0987 1.0961 1.0930 1.0732 1.0659
irintensity: 1.4138 0.2867 1.5951 0.2040 0.2341 2.0781 0.6255 0.0457 0.6947 1.3297 2.1525 1.8359 5.2946 0.8381 4.0197 0.6360 9.2636 1.1139 8.3097 0.3277 9.3565 3.7791 48.6813 85.4287 7.1779 28.6621 4.6455 6.7288 1.6399 13.4511 3.6258 0.3983 1.0212 3.0495 12.5058 3.7106 15.6612 5.1433 5.9433 9.9406 12.4335 4.8918 0.3728 16.9947 13.2812 39.3731 11.9549 31.0333 7.3230 59.9330 64.2467 12.4101 4.1326 11.6029 17.6835 14.5067 28.2103 5.7756 1.4679 3.5919 5.0676 7.8555 0.2343 49.5486 9.7126 14.0309 4.5832 13.7279 1.9461 94.8891 3.0405 2.1987 16.2693 9.7014 9.6515 3.0442 5.1486 26.4065 373.3246 56.5207 76.8092 25.7935 18.6102 1.2310 22.6306 15.6676 3.0059 3.2599 21.0955 193.8409 0.1060 5.5756 8.3527 0.4199 3.4699 8.2936 31.5421 12.8815 1.6945 15.4804 2.7902 26.0204 1.4517 19.4179 22.4699 14.3744 38.9950 3.6063 12.2395 17.2319 32.9279 19.4177 16.6299 6.6404 119.5943 30.6284 5.0424 9.6195 42.3804 185.4629 58.4005 64.5170 27.7469 25.2266 23.4520 30.4657 117.4502 31.8625 14.7007 18.2353 43.2537 32.5046 22.7339 15.5669 11.5395 10.7833 12.1658 13.2687 14.1577 8.5187 6.8532 0.6927 8.5262 5.6836
temp: 298.150 k
press: 1.00000 atm
elementType: 17 8 8 8 8 7 6 6 6 6 6 6 6 6 6 6 6 6 6 6 6 6 6 6 6 6 1 1 1 1 1 1 1 1 1 1 1 1 1 1 1 1 1 1 1 1 1 1 1 1
symmnumber: 1
zpe: 1050527.0 jmol-1
zpe.correction: 0.400125 hartree
zpe.thermalcorrener: 0.427006 hartree
zpe.thermalcorrenthalpy: 0.427950 hartree
zpe.thermalcorrgfe: 0.340332 hartree
zpe.sumelectzpe: -1590.262255 hartree
zpe.sumelectthermal: -1590.235374 hartree
zpe.sumelectthermalent: -1590.234430 hartree
zpe.sumelectthermalfe: -1590.322047 hartree
dipole: -0.9167 -1.6294 -1.5770
dipole: 2.4458
quadrupole: -127.5520 -173.5880 -154.4060
quadrupole: -1.4701 -2.8531 1.9228
quadrupole: 24.2966 -21.7393 -2.5573 -1.4701 -2.8531 1.9228
hfenergy: -1590.6623797 hartree
pointgroup: C01 [X(C20H24Cl1N1O4)]
dipole: -0.1634808 0.8702437 0.3766945 debye
polarizability: 313.114776|-42.9939033|185.8750774|9.8153506|1.4984047|213.7205138 unknown
InChI: InChI=1S/C20H24ClNO4/c1-14(22-12-19(23)16-4-3-5-17(21)11-16)10-15-6-8-18(9-7-15)26-13-20(24)25-2/h3-9,11,14,19,22-23H,10,12-13H2,1-2H3
charge 0 multiplicity 1
50 atoms
Cl 1.511187 -2.242148 2.322063
O  -3.855477 -2.500606 1.721612
O  2.755331 0.880223 -0.879033
O  5.582781 -0.531755 0.734414
O  4.129575 -1.599307 -0.744834
N  -3.347367 0.855801 0.046007
C  -3.40127 2.279654 0.468272
C  -2.541203 3.138614 -0.506456
C  -3.72773 -0.113462 1.090841
C  -3.49612 -1.577855 0.62549
C  -4.85452 2.794415 0.515053
C  -1.101043 2.651394 -0.603961
C  -2.039912 -1.847749 0.278368
C  -0.591918 2.105755 -1.812756
C  -0.245428 2.664016 0.526379
C  -1.08153 -1.966137 1.317333
C  -1.618062 -1.923784 -1.070543
C  0.699406 1.548896 -1.881803
C  1.052034 2.108178 0.480377
C  1.510831 1.521258 -0.724164
C  0.268224 -2.133359 0.970247
C  -0.251304 -2.09964 -1.385232
C  0.718853 -2.200711 -0.362206
C  3.502685 0.549556 0.32902
C  4.401365 -0.639029 0.003519
C  6.512559 -1.684836 0.624624
H  -2.96005 2.398863 1.493046
H  -3.016917 3.113146 -1.505409
H  -2.580333 4.186188 -0.149807
H  -2.408576 0.633109 -0.319469
H  -4.805445 0.010161 1.324852
H  -3.165448 0.031525 2.048204
H  -4.127646 -1.763827 -0.268026
H  -5.464876 2.227271 1.240965
H  -4.882898 3.858779 0.814688
H  -5.323889 2.691754 -0.4798
H  -1.226083 2.097542 -2.707226
H  -0.59843 3.104964 1.466809
H  -1.404288 -1.944432 2.3617
H  -2.359028 -1.846334 -1.874447
H  1.083963 1.103753 -2.804333
H  1.682623 2.137945 1.374582
H  -4.793792 -2.326568 1.990229
H  0.071965 -2.151984 -2.43011
H  1.781729 -2.308444 -0.600986
H  2.822746 0.232364 1.147269
H  4.113846 1.403044 0.674959
H  7.352934 -1.430068 1.284508
H  6.845713 -1.802539 -0.4197
H  6.010331 -2.609592 0.954472
