program: Gaussian 09
title: 000158857
version: EM64L-G09RevD.01
frameworkgroup: C1[X(C10HF21O)]
method: RPBEPBE
basis: SDD
operation: Freq
keyword: #p
keyword: freq=noraman
keyword: PBEPBE/SDD
title: #p freq=noraman PBEPBE/SDD
converged: YES YES NO NO
title: Mulliken charges:
elementType: F F F F F F F F F F F F F F F F F F F F F O C C C C C C C C C C H
charge: -0.107159 -0.122134 -0.117085 -0.115405 -0.121577 -0.121942 -0.113201 -0.125056 -0.129205 -0.114036 -0.120040 -0.119515 -0.125965 -0.125234 -0.117066 -0.128746 -0.149413 -0.155649 -0.124326 -0.118867 -0.121301 -0.382791 0.247222 0.216245 0.247660 0.220567 0.260889 0.251087 0.255119 0.214459 0.252177 0.385419 0.424866
chargesum: 0.00000
title: Mulliken charges with hydrogens summed into heavy atoms:
elementType: F F F F F F F F F F F F F F F F F F F F F O C C C C C C C C C C
charge: -0.107159 -0.122134 -0.117085 -0.115405 -0.121577 -0.121942 -0.113201 -0.125056 -0.129205 -0.114036 -0.120040 -0.119515 -0.125965 -0.125234 -0.117066 -0.128746 -0.149413 -0.155649 -0.124326 -0.118867 -0.121301 0.042076 0.247222 0.216245 0.247660 0.220567 0.260889 0.251087 0.255119 0.214459 0.252177 0.385419
polarizability: 1.40903525e+02 9.91374654e-01 1.14696648e+02 -2.83722019e-01 1.33652818e+00 1.13376800e+02
1716.lowfreq: -6.2481 -3.6775 -1.5367 -0.0007 -0.0003 -0.0002 19.1656 24.6809 30.1501
frequency: 19.1487 24.6314 30.1334 40.8051 50.7853 53.5801 57.4821 72.0658 81.9408 89.3264 111.0547 121.4105 130.1919 144.8629 155.0038 165.6496 183.4978 192.1517 198.5442 213.2372 218.5934 229.0134 231.7605 237.4717 247.3921 257.6702 263.4608 267.8096 278.1649 286.9434 288.1234 294.3582 298.9923 301.6214 307.3494 323.2142 326.4855 329.3999 336.7546 339.3833 353.9181 380.7404 401.6377 420.5979 438.8660 450.1570 458.4094 484.9944 490.7871 504.4023 523.8570 533.4126 545.9332 554.6201 557.7184 582.8688 586.1451 594.2408 632.0180 644.9025 652.9996 696.1552 813.8635 857.4577 896.6603 941.2739 953.9145 982.8654 998.3820 1003.9050 1012.7659 1020.5976 1024.4649 1031.8764 1037.8186 1040.7398 1045.8388 1052.6830 1061.7550 1065.8140 1085.6275 1100.7389 1104.9062 1111.2579 1119.5886 1127.0398 1141.7828 1152.0419 1170.5402 1190.1248 1211.0374 1367.8047 3568.6407
redmass: 15.9700 15.8212 17.5966 15.7710 13.9843 17.2858 16.1970 18.1083 17.8892 15.7206 18.3942 17.5348 16.5706 16.5539 17.4222 16.3517 18.1277 16.9774 15.9935 17.2158 15.0066 17.3050 18.6920 14.7308 16.6173 17.7095 18.2398 10.2365 17.6248 15.4814 17.5204 3.9688 4.3529 8.2785 17.9037 12.2068 16.0878 16.3712 17.3737 17.6840 3.9671 9.0516 12.6055 14.5516 14.8811 16.7473 17.7176 9.8399 17.0655 17.4380 13.2903 17.1531 17.0428 16.7656 12.9418 14.8407 16.7920 17.2520 17.1208 13.6273 8.0938 15.0262 13.0782 11.0632 9.1229 8.9651 8.6822 12.6305 10.1538 8.4149 11.9518 12.4165 13.0923 13.0883 12.8010 12.9200 12.8175 12.9937 13.2480 13.2963 12.9787 3.4422 11.7284 12.0565 12.4977 12.4563 11.9433 12.0369 12.1985 12.2289 12.2528 2.6852 1.0656
irintensity: 0.2207 0.2445 0.1510 0.4361 0.6142 0.5785 0.3809 0.0349 0.1519 0.4262 0.2498 0.6389 0.5213 0.9352 0.1055 0.3791 2.5350 14.1818 8.8845 0.6376 6.0849 1.0434 0.1794 1.3275 3.3160 1.1583 4.6615 4.9874 1.8015 0.7967 1.0852 27.2203 30.5291 11.4192 0.4390 8.6719 1.4738 1.4490 2.6845 0.9440 45.6985 14.4409 13.8910 12.2362 4.3314 7.5859 10.5368 40.0030 30.6099 0.4210 12.0495 13.4191 0.8444 20.8994 9.6056 13.5525 6.6466 32.3713 41.8765 125.2812 22.0708 107.7147 159.2250 61.8534 18.2404 95.2534 213.2123 21.5856 22.3957 52.8922 17.2189 43.0261 97.7245 48.8157 11.8209 15.5540 14.4515 53.6893 329.4661 229.7528 522.6157 93.0704 40.0928 82.0378 51.8551 126.6685 135.2835 23.2421 26.3420 4.4700 34.7547 28.4517 90.7506
temp: 298.150 k
press: 1.00000 atm
elementType: 9 9 9 9 9 9 9 9 9 9 9 9 9 9 9 9 9 9 9 9 9 8 6 6 6 6 6 6 6 6 6 6 1
symmnumber: 1
zpe: 326476.8 jmol-1
zpe.correction: 0.124348 hartree
zpe.thermalcorrener: 0.156347 hartree
zpe.thermalcorrenthalpy: 0.157292 hartree
zpe.thermalcorrgfe: 0.060406 hartree
zpe.sumelectzpe: -2551.002462 hartree
zpe.sumelectthermal: -2550.970463 hartree
zpe.sumelectthermalent: -2550.969519 hartree
zpe.sumelectthermalfe: -2551.066405 hartree
dipole: -2.6696 0.7194 1.4025
dipole: 3.1002
quadrupole: -154.1919 -184.2850 -182.5918
quadrupole: -4.6162 -10.2954 1.3422
quadrupole: 19.4976 -10.5954 -8.9022 -4.6162 -10.2954 1.3422
hfenergy: -2551.1268103 hartree
pointgroup: C01 [X(C10H1F21O1)]
dipole: 1.0541996 0.45631 -0.4100271 debye
polarizability: 140.8457627|-1.2783288|115.4944558|-0.9875081|-0.4284922|112.6367553 unknown
InChI: InChI=1S/C10HF21O/c11-1(12,3(15,16)5(19,20)7(23,24)9(27,28)29)2(13,14)4(17,18)6(21,22)8(25,26)10(30,31)32/h32H
charge 0 multiplicity 1
33 atoms
F  0.073489 -0.678272 1.413852
F  -0.725901 1.40728 1.895483
F  1.939549 1.307797 1.44468
F  0.748825 2.591613 -0.011634
F  2.917022 1.605548 -1.163232
F  1.002822 0.692369 -2.008616
F  -1.550042 1.499992 -1.003628
F  -1.186087 -0.761217 -0.95834
F  1.486406 -1.69764 -0.688986
F  3.058247 -0.965186 -2.166895
F  -3.361634 1.42497 0.933567
F  -2.696019 -0.627814 1.690936
F  4.047169 -2.467114 -0.168483
F  3.077835 -1.194125 1.456014
F  -3.698354 -1.916269 -0.403717
F  -3.822727 -0.034555 -1.701402
F  5.880681 -0.956826 1.124257
F  4.687567 0.954855 0.916604
F  -5.575577 -0.541468 1.444464
F  -6.268086 -1.18934 -0.619047
F  -5.857492 0.997974 -0.206948
O  5.486419 -0.100301 -1.007302
C  1.070781 1.257661 0.330401
C  -0.261033 0.56913 0.84939
C  1.882242 0.678093 -0.896725
C  -1.457496 0.373378 -0.160581
C  2.536072 -0.761257 -0.871352
C  -2.863155 0.164589 0.534434
C  3.660568 -1.14871 0.170888
C  -3.943047 -0.528944 -0.382456
C  4.965676 -0.284996 0.249503
C  -5.435403 -0.303806 0.070937
H  6.342581 0.401188 -1.000368
