program: Gaussian 09
title: 000158816
version: EM64L-G09RevD.01
frameworkgroup: C1[X(C12H4Cl4O2)]
method: RPBEPBE
basis: SDD
operation: Freq
keyword: #p
keyword: freq=noraman
keyword: PBEPBE/SDD
title: #p freq=noraman PBEPBE/SDD
converged: NO NO NO NO
title: Mulliken charges:
elementType: Cl Cl Cl Cl O O C C C C C C C C C C C C H H H H
charge: 0.010555 0.010558 0.010564 0.010551 -0.268058 -0.268054 0.265956 0.265970 0.265952 0.265966 -0.344239 -0.344239 -0.344235 -0.344233 -0.088561 -0.088569 -0.088581 -0.088548 0.290312 0.290311 0.290310 0.290311
chargesum: 0.00000
title: Mulliken charges with hydrogens summed into heavy atoms:
elementType: Cl Cl Cl Cl O O C C C C C C C C C C C C
charge: 0.010555 0.010558 0.010564 0.010551 -0.268058 -0.268054 0.265956 0.265970 0.265952 0.265966 -0.053927 -0.053928 -0.053925 -0.053922 -0.088561 -0.088569 -0.088581 -0.088548
polarizability: 3.34763470e+02 4.23722763e-04 1.68560207e+02 -2.19834427e-05 -4.73211695e-04 6.08124092e+01
1716.lowfreq: -4.4950 -1.9381 -0.0030 -0.0017 0.0020 11.8759 23.2554 46.7544 106.0950
frequency: 23.2554 46.7544 106.0950 107.3831 129.4176 161.6440 170.6082 183.5791 207.7028 214.1748 242.6523 272.4738 309.7600 363.6670 369.5102 372.2538 420.4445 442.4639 445.4731 467.0266 505.7293 528.5486 579.2839 597.6209 615.8939 624.7053 654.5427 661.4774 668.0102 718.0070 750.7475 843.5930 845.7077 847.2467 869.5085 873.4000 873.4892 937.5108 1097.7464 1101.1738 1109.5851 1113.4680 1218.8896 1219.2168 1226.5201 1283.6780 1343.6003 1353.9734 1371.8673 1375.5493 1461.3173 1474.1465 1560.7255 1583.5791 1588.4735 1635.6896 3174.3021 3174.5693 3176.2901 3176.6539
redmass: 17.6805 21.1663 16.5768 11.6236 10.4898 12.0632 33.2736 30.8676 5.5086 15.5163 20.7689 7.9275 13.7113 11.9835 12.2519 15.6157 16.6219 3.1056 3.1269 8.5666 5.1730 12.6542 11.3831 12.1350 12.4193 7.7610 4.1351 7.6401 3.9049 7.1706 7.6462 1.4038 5.3861 1.4327 1.3785 1.3818 9.9888 11.4041 1.7933 1.6241 7.5668 10.5785 1.2185 6.0254 1.3113 5.3712 9.1449 9.1428 6.6178 7.8446 3.7714 4.2120 10.7290 8.0116 10.6543 8.5554 1.0923 1.0924 1.0932 1.0934
irintensity: 0.0157 0.0000 0.0717 0.0000 0.0000 1.1363 0.0000 0.1194 0.0000 0.0000 0.0000 0.0000 0.0718 0.0000 6.2127 0.0000 20.9973 0.0000 17.9045 11.5359 0.0000 0.0000 0.0000 0.0000 0.0000 0.0000 0.0000 24.3136 0.0000 0.0000 20.6450 0.0000 203.0554 0.0000 0.0001 110.8184 37.0184 0.0000 215.4393 0.0000 70.9661 0.0000 0.0000 0.0000 1.6884 298.7504 0.0000 127.2982 0.0000 33.3125 1118.4550 0.0000 22.8177 0.0000 0.0000 4.5016 0.0055 6.4228 2.8599 0.0014
temp: 298.150 k
press: 1.00000 atm
elementType: 17 17 17 17 8 8 6 6 6 6 6 6 6 6 6 6 6 6 1 1 1 1
symmnumber: 1
zpe: 328209.7 jmol-1
zpe.correction: 0.125008 hartree
zpe.thermalcorrener: 0.140350 hartree
zpe.thermalcorrenthalpy: 0.141294 hartree
zpe.thermalcorrgfe: 0.080560 hartree
zpe.sumelectzpe: -2449.093172 hartree
zpe.sumelectthermal: -2449.077831 hartree
zpe.sumelectthermalent: -2449.076886 hartree
zpe.sumelectthermalfe: -2449.137620 hartree
dipole: 0.0000 0.0000 0.0000
dipole: 0.0000
quadrupole: -150.2585 -123.2224 -131.9405
quadrupole: 0.0005 0.0001 -0.0001
quadrupole: -15.1180 11.9181 3.2000 0.0005 0.0001 -0.0001
hfenergy: -2449.2181804 hartree
pointgroup: C01 [X(C12H4Cl4O2)]
dipole: -0.0000016 0.0000069 0.0000016 debye
dipolederiv: -0.6257109 -0.2821893 -0.0000003 -0.3823592 -0.2403483 -0.0000006 -0.0000028 -0.0000005 -0.0174559 -0.625704 0.2821932 -0.0000182 0.3823628 -0.2403522 0.0000127 -0.0000329 0.0000182 -0.017453 -0.6257124 0.2821909 0.0000187 0.3823635 -0.2403438 -0.0000127 0.0000195 -0.0000097 -0.0174488 -0.6257205 -0.2821851 0.0000008 -0.3823579 -0.240346 -0.0000014 0.0000032 -0.000001 -0.0174604 -2.2659508 0.0000082 -0.0000004 0.0000444 -0.3511348 0.0000075 0.000011 0.0000221 -0.1456062 -2.265996 0.0000304 -0.0000058 0.0000347 -0.3511401 -0.0000083 -0.0000158 -0.0000258 -0.1456049 1.361283 -0.1725093 0.0000191 -1.023492 0.1411317 -0.0000094 0.0000166 -0.0000101 0.0733206 1.3612877 0.1724845 0.0000355 1.0234727 0.1411217 0.0000071 0.0000674 0.0000184 0.0733201 1.3612454 0.172493 -0.0000298 1.0234918 0.1411151 -0.0000053 -0.0000478 -0.0000151 0.0733133 1.361288 -0.1725265 -0.0000132 -1.0235183 0.1411436 0.000006 -0.0000219 0.0000102 0.0733201 -0.4161339 -0.0663516 0.000002 -0.0942146 -0.0584386 -0.000002 -0.000003 -0.0000019 -0.0986836 -0.4161045 0.0663682 -0.000011 0.0942027 -0.0584384 0.000007 -0.0000234 0.000008 -0.0986796 -0.4160866 0.0663661 0.0000072 0.0941837 -0.0584348 -0.0000039 0.0000099 -0.0000005 -0.0986752 -0.4161209 -0.0663424 -0.0000022 -0.094203 -0.0584363 0.0000066 -0.0000052 0.0000045 -0.0986817 0.7135234 0.5580598 -0.0000074 0.6590344 0.2934547 0.0000033 -0.0000089 0.0000064 -0.0656621 0.7134962 -0.5580711 0.000035 -0.6590402 0.2934464 -0.0000222 0.0000659 -0.0000332 -0.0656673 0.7135018 -0.558064 -0.0000345 -0.6590425 0.2934421 0.0000206 -0.0000368 0.0000171 -0.0656696 0.7135332 0.5580471 0.0000043 0.6590391 0.2934534 0. -0.0000006 -0.0000017 -0.0656591 0.1000194 0.0221442 -0.0000023 0.0177513 0.0397759 0.0000015 0.0000037 0.0000005 0.1812836 0.1000202 -0.022143 -0.0000016 -0.0177517 0.0397761 0.000001 -0.000005 -0.0000006 0.1812837 0.1000214 -0.0221471 0.0000025 -0.0177514 0.0397761 -0.0000027 0.0000071 -0.0000024 0.1812828 0.1000209 0.0221439 0.0000017 0.0177495 0.0397764 -0.0000045 -0.0000004 -0.0000027 0.1812831 unknown
polarizability: 334.7634703|-0.0010838|168.5602074|-0.000022|0.0004732|60.8124092 unknown
InChI: InChI=1S/C12H4Cl4O2/c13-5-1-9-10(2-6(5)14)18-12-4-8(16)7(15)3-11(12)17-9/h1-4H
charge 0 multiplicity 1
22 atoms
Cl 5.170199 1.646764 0.000011
Cl 5.170186 -1.646811 0.000089
Cl -5.170183 1.64679 0.000104
Cl -5.170194 -1.646759 0.0000
O  0.000012 1.46172 -0.000088
O  -0.000006 -1.461725 -0.000098
C  1.199326 0.70997 -0.000046
C  1.199326 -0.709989 -0.00003
C  -1.199319 0.709968 -0.000032
C  -1.199315 -0.709981 -0.000053
C  2.409857 1.41445 -0.000022
C  2.409846 -1.41448 0.000012
C  -2.409845 1.414472 0.000012
C  -2.409854 -1.41446 -0.000052
C  3.632116 0.707205 0.000003
C  3.632114 -0.707243 0.000018
C  -3.632107 0.707244 0.000042
C  -3.632098 -0.707213 -0.000004
H  2.395037 2.507734 -0.000029
H  2.395025 -2.507768 0.000021
H  -2.394996 2.50776 0.000029
H  -2.395029 -2.507747 -0.000087
