program: Gaussian 09
title: 000158895
version: EM64L-G09RevD.01
frameworkgroup: C1[X(C19H18N2O4)]
method: RPBEPBE
basis: SDD
operation: Freq
keyword: #p
keyword: freq=noraman
keyword: PBEPBE/SDD
title: #p freq=noraman PBEPBE/SDD
converged: YES YES NO NO
title: Mulliken charges:
elementType: O O O O N N C C C C C C C C C C C C C C C C C C C H H H H H H H H H H H H H H H H H H
charge: -0.189009 -0.260882 -0.229769 -0.239329 -0.452199 -0.185352 -0.040859 0.124463 0.416237 0.446552 0.196230 -0.277871 -0.337562 -0.384054 -0.410420 -0.389210 -0.234599 -0.236508 -0.225815 -0.234961 -0.242659 -0.240461 0.312105 -0.480877 -0.659440 0.340001 0.274405 0.254228 0.261549 0.255159 0.258474 0.251195 0.230070 0.231300 0.229613 0.232410 0.231897 0.234522 0.244146 0.250126 0.233829 0.215423 0.227900
chargesum: 0.00000
title: Mulliken charges with hydrogens summed into heavy atoms:
elementType: O O O O N N C C C C C C C C C C C C C C C C C C C
charge: -0.189009 -0.260882 -0.229769 -0.239329 -0.112198 -0.185352 -0.040859 0.124463 0.416237 0.446552 0.196230 0.250763 -0.076013 -0.128894 -0.151946 -0.138014 -0.004529 -0.005208 0.003798 -0.002551 -0.010762 -0.005939 0.312105 0.013395 0.017713
polarizability: 2.40591354e+02 5.83894569e+00 2.32479551e+02 1.32509875e+01 1.05222358e+01 1.94822493e+02
1716.lowfreq: -9.4694 -9.1286 -6.5373 -0.0008 -0.0007 -0.0006 4.0691 9.0786 17.9798
frequency: -8.0960 0.4767 17.7662 21.9486 35.6939 39.0974 55.9791 67.4769 90.1023 96.8214 138.2480 151.9893 166.4210 199.0877 216.1229 237.1824 241.7773 258.1172 290.8425 300.2728 312.2666 320.8142 346.6198 397.9712 403.3228 414.9005 487.2731 498.4007 504.5585 524.4535 539.7944 586.4092 595.4190 614.9516 616.1024 629.6376 662.2629 673.4673 689.2983 701.4886 706.3319 711.5853 729.5783 769.9915 777.2905 791.5562 807.8803 852.8532 858.1351 876.8479 894.3542 906.5672 928.8365 929.3378 954.9800 979.9932 983.6460 989.9987 991.0729 999.8309 1000.3665 1012.5500 1024.7025 1029.6138 1053.8109 1065.4078 1071.5451 1087.1739 1090.0399 1108.3706 1113.8749 1165.4154 1173.3647 1175.9654 1180.9074 1192.0906 1197.9517 1207.5023 1237.4809 1243.1803 1310.4335 1317.4606 1325.3459 1331.9356 1348.7939 1366.1412 1377.7910 1382.4250 1387.2056 1399.0982 1434.6590 1437.7464 1441.8062 1455.5221 1472.6193 1479.3268 1481.3064 1483.0751 1590.4880 1593.8462 1608.4941 1611.0519 1654.9756 1667.5407 1722.4255 2998.7001 3001.3014 3042.7831 3046.8459 3097.1133 3103.6614 3120.4584 3123.2321 3127.5546 3132.9052 3136.2650 3144.0415 3147.6715 3154.4334 3156.0796 3168.1471 3168.4878 3598.3104
redmass: 2.1858 3.5833 4.5674 4.0458 8.4551 4.2416 5.5817 4.6222 5.6114 6.0245 7.0905 4.1192 5.7789 1.3691 4.7402 4.5725 3.8686 5.2828 4.3176 5.5666 5.3624 4.0912 5.6098 2.8005 2.8396 6.1185 3.9007 1.9510 4.0672 1.7477 2.9045 8.8248 6.9209 6.3854 6.3982 4.9981 5.9054 4.5271 6.8039 1.7929 1.8205 5.3805 6.2659 2.0563 2.0568 1.3708 3.6965 1.2530 1.2482 5.3423 6.7219 4.0983 1.7846 1.5523 2.4780 1.3941 1.3907 5.9325 5.7443 1.3327 1.3299 2.0477 2.5870 2.1814 2.9258 2.9083 2.4878 1.6204 1.6350 2.5664 2.7958 2.3826 1.0919 1.0524 2.2696 1.3177 1.1551 3.7129 3.9377 1.1731 1.4422 1.3432 1.3765 1.7836 2.0433 2.5316 6.1683 7.8819 1.6136 1.2102 2.2213 2.2280 1.0840 1.0981 1.0390 2.1978 1.0514 2.1796 6.0560 6.2823 6.0067 5.9782 10.4605 10.3752 9.9908 1.0439 1.0530 1.0562 1.0987 1.1003 1.1004 1.1101 1.0866 1.0848 1.0871 1.0879 1.0919 1.0923 1.0959 1.0963 1.1014 1.1014 1.0800
irintensity: 0.1872 0.0999 0.4522 0.3124 1.2962 0.0248 1.1075 1.2008 0.4506 0.6858 4.5744 1.6236 0.2151 1.2157 0.4106 1.5718 4.9564 0.7433 5.1586 1.5811 0.9116 24.7841 1.6035 0.0129 0.7532 17.5305 9.4218 52.4577 27.7298 88.8406 1.1722 26.1075 13.4258 1.3637 1.1398 7.9830 18.0135 2.4473 9.2964 35.7119 59.6958 30.7241 36.6134 35.6342 35.6391 12.9534 24.2303 0.1726 1.2742 9.2440 160.7984 6.6431 3.1049 2.4395 29.4101 0.4779 1.3422 1.4649 1.3209 0.0627 1.3279 119.3412 4.1081 10.4757 21.8608 225.8505 40.4435 0.6071 3.3830 48.0669 194.8974 28.8082 0.6498 0.0754 4.7331 2.9037 0.7510 8.8904 67.7232 0.0770 23.4520 2.3365 13.8573 169.5816 63.2357 114.9256 0.2399 1.4783 75.6358 20.4631 20.3300 6.8850 29.7445 52.5852 11.8804 14.9538 14.0844 18.1407 0.9488 0.4457 4.2407 2.4058 239.3987 375.6865 327.4434 39.0385 2.6728 11.2672 3.0513 26.3957 29.8254 7.0373 3.6628 0.2507 0.3871 3.9571 14.5072 16.9751 25.2477 23.4887 22.1957 15.8760 49.6477
temp: 298.150 k
press: 1.00000 atm
elementType: 8 8 8 8 7 7 6 6 6 6 6 6 6 6 6 6 6 6 6 6 6 6 6 6 6 1 1 1 1 1 1 1 1 1 1 1 1 1 1 1 1 1 1
symmnumber: 1
zpe: 874268.8 jmol-1
zpe.correction: 0.332991 hartree
zpe.thermalcorrener: 0.355082 hartree
zpe.thermalcorrenthalpy: 0.356027 hartree
zpe.thermalcorrgfe: 0.274612 hartree
zpe.sumelectzpe: -1143.478976 hartree
zpe.sumelectthermal: -1143.456885 hartree
zpe.sumelectthermalent: -1143.455941 hartree
zpe.sumelectthermalfe: -1143.537356 hartree
dipole: -3.4599 2.6464 0.4417
dipole: 4.3783
quadrupole: -129.1044 -134.5393 -156.1488
quadrupole: 9.9839 3.9651 5.1499
quadrupole: 10.8265 5.3915 -16.2180 9.9839 3.9651 5.1499
hfenergy: -1143.8119672 hartree
pointgroup: C01 [X(C19H18N2O4)]
dipole: -1.4516859 -0.9178964 -0.1316513 debye
polarizability: 239.3330062|-6.8885625|234.4448558|-12.2074415|10.2243922|194.1155357 unknown
InChI: InChI=1S/C19H18N2O4/c1-2-16(22)25-13-21-17(23)19(20-18(21)24,14-9-5-3-6-10-14)15-11-7-4-8-12-15/h3-12,20H,2,13H2,1H3
charge 0 multiplicity 1
43 atoms
O  0.688802 0.581519 1.427542
O  3.391063 0.394237 -0.683619
O  0.902979 1.599174 -3.163853
O  4.5803 1.261099 1.137227
N  -0.783066 0.578679 -1.827442
N  1.141936 1.161663 -0.820876
C  -1.004879 0.203588 -0.409224
C  0.354445 0.65903 0.22549
C  -1.125072 -1.324212 -0.212364
C  -2.214972 0.975697 0.158784
C  0.447591 1.151397 -2.08687
C  2.511277 1.59588 -0.688924
C  -1.478381 -1.827426 1.065506
C  -3.520603 0.513629 -0.150181
C  -0.833528 -2.229262 -1.259868
C  -2.065522 2.172839 0.899557
C  -1.552594 -3.218787 1.284802
C  -4.655755 1.243504 0.261444
C  -0.915896 -3.623556 -1.039883
C  -3.20302 2.899199 1.318517
C  -1.276486 -4.122767 0.231571
C  -4.500468 2.441532 0.99719
C  4.371917 0.330623 0.332139
C  5.094512 -1.003078 0.260275
C  6.214196 -1.130482 1.30775
H  -1.526505 0.578629 -2.52401
H  2.664371 2.148897 0.253109
H  2.768446 2.195089 -1.576256
H  -1.683961 -1.129438 1.883893
H  -3.648079 -0.427981 -0.697748
H  -0.538514 -1.847336 -2.242731
H  -1.068741 2.534417 1.172247
H  -1.823369 -3.597763 2.276376
H  -5.658064 0.87595 0.015509
H  -0.693801 -4.3161 -1.859364
H  -3.074747 3.819796 1.898238
H  -1.337489 -5.203327 0.4024
H  -5.38075 3.006991 1.322045
H  5.485234 -1.121554 -0.768311
H  4.335194 -1.799037 0.38406
H  5.81222 -1.028977 2.330011
H  6.707715 -2.114399 1.220992
H  6.976266 -0.343877 1.173048
