program: Gaussian 09
title: 000158772
version: EM64L-G09RevD.01
frameworkgroup: C1[X(CH5Cl2N2OP)]
method: RPBEPBE
basis: SDD
operation: Freq
keyword: #p
keyword: freq=noraman
keyword: PBEPBE/SDD
title: #p freq=noraman PBEPBE/SDD
converged: YES YES NO NO
title: Mulliken charges:
elementType: Cl Cl P O N N C H H H H H
charge: 0.026148 0.063139 1.341987 -0.589076 -0.951890 -0.931365 -0.723881 0.346454 0.369411 0.348045 0.348377 0.352651
chargesum: 0.00000
title: Mulliken charges with hydrogens summed into heavy atoms:
elementType: Cl Cl P O N N C
charge: 0.026148 0.063139 1.341987 -0.589076 -0.234434 -0.230337 -0.377427
polarizability: 7.13483038e+01 -2.35999845e+00 7.88013180e+01 -5.48219550e+00 -2.15088735e+00 5.43416885e+01
1716.lowfreq: -13.8973 -9.4720 -0.0030 -0.0013 0.0018 5.1071 44.5547 131.2895 150.9856
frequency: 44.5202 131.2874 150.9849 202.8446 227.7835 254.6059 270.3671 306.6923 343.9395 394.1365 435.4391 499.3015 563.8093 584.8662 668.0539 722.8549 774.3064 838.1856 927.8157 985.8773 1065.9047 1153.9479 1166.4318 1551.4425 1576.3059 3125.0840 3506.1172 3544.2935 3644.3921 3697.0362
redmass: 7.7301 6.5026 11.8782 9.0007 3.7699 1.1845 4.1184 4.7369 5.3262 4.9750 1.1325 1.2869 1.4656 5.9898 8.1508 6.9076 4.3429 3.7393 1.7057 1.3613 4.1101 1.2371 1.0620 1.1051 1.0954 1.0881 1.0455 1.0444 1.0996 1.1031
irintensity: 2.2068 0.7971 3.0630 1.9133 2.8213 6.8947 0.8707 3.7220 27.5987 28.2219 16.7334 350.6956 238.6703 55.8396 90.1605 36.8772 59.8961 150.6205 35.1605 87.1586 124.8359 20.0600 8.4015 73.6915 65.2193 2.4566 32.4871 49.9176 38.4233 48.0941
temp: 298.150 k
press: 1.00000 atm
elementType: 17 17 15 8 7 7 6 1 1 1 1 1
symmnumber: 1
zpe: 199528.9 jmol-1
zpe.correction: 0.075997 hartree
zpe.thermalcorrener: 0.085500 hartree
zpe.thermalcorrenthalpy: 0.086444 hartree
zpe.thermalcorrgfe: 0.040739 hartree
zpe.sumelectzpe: -1486.583764 hartree
zpe.sumelectthermal: -1486.574261 hartree
zpe.sumelectthermalent: -1486.573317 hartree
zpe.sumelectthermalfe: -1486.619022 hartree
dipole: 2.4300 1.0204 -4.7927
dipole: 5.4696
quadrupole: -59.4736 -56.8358 -68.6109
quadrupole: 0.5631 -6.1426 2.3463
quadrupole: 2.1665 4.8043 -6.9708 0.5631 -6.1426 2.3463
hfenergy: -1486.6597605 hartree
pointgroup: C01 [X(C1H5Cl2N2O1P1)]
dipole: -0.9747689 -0.0374657 -1.9180849 debye
dipolederiv: -0.3423828 0.2476559 -0.0165804 0.2061207 -0.659546 0.0046236 -0.0083673 0.046487 -0.0989995 -0.320915 -0.2565711 -0.0678617 -0.2207306 -0.5024101 -0.0962224 -0.0691211 -0.1446484 -0.100448 1.9366537 -0.0486196 0.166277 -0.0192935 1.6158331 -0.0251276 -0.1006019 -0.0261475 1.569898 -0.6927569 0.0181657 0.0212926 0.0077368 -0.5873054 -0.0410851 0.061149 -0.0181814 -0.6920998 -1.17203 0.0705752 0.0153966 0.069269 -0.8396379 0.2052847 -0.0066813 0.2757632 -0.6432906 -0.7619444 -0.2514115 -0.0611088 -0.2151314 -0.8429179 -0.0636453 -0.050243 -0.159053 -1.0185335 0.3466531 0.0110019 0.108193 0.0365987 1.0785601 0.1247069 0.2929711 0.0998224 0.0104398 -0.0602508 0.0058436 -0.0028562 -0.0038924 -0.0382515 -0.007277 0.0272568 -0.0051797 -0.0514391 0.3371092 0.054348 -0.0575589 0.0316395 0.2301527 -0.0364514 -0.0908451 0.0120594 0.1858242 0.3548172 0.086225 -0.057527 0.0985054 0.185056 0.0046514 -0.0266098 -0.0384347 0.1461035 0.2297077 0.0421292 -0.0675118 0.0608349 0.1743127 -0.00484 -0.0726779 0.0001972 0.3391739 0.1453392 0.0206579 0.0198456 -0.0516571 0.1861542 -0.0646179 0.0437706 -0.0426843 0.3533712 unknown
polarizability: 71.0136802|-2.6804529|77.966453|5.3305752|5.4473371|55.5111771 unknown
InChI: InChI=1S/CH5Cl2N2OP/c2-1(3)7(4,5)6/h1H,4-5H2
charge 0 multiplicity 1
12 atoms
Cl 1.79573 -1.622119 -0.177373
Cl 1.901895 1.430009 0.182392
P  -0.841073 -0.004635 0.198978
O  -0.916506 0.108934 1.787873
N  -1.68436 1.268147 -0.59927
N  -1.451164 -1.379363 -0.673592
C  0.94732 0.013069 -0.513162
H  0.91445 0.129788 -1.604115
H  -1.898722 2.120653 -0.085397
H  -1.941169 1.219684 -1.583755
H  -0.910217 -2.246652 -0.663141
H  -2.464982 -1.501015 -0.722838
