program: Gaussian 09
title: 000158734
version: EM64L-G09RevD.01
frameworkgroup: C1[X(C18H21NO4)]
method: RPBEPBE
basis: SDD
operation: Freq
keyword: #p
keyword: freq=noraman
keyword: PBEPBE/SDD
title: #p freq=noraman PBEPBE/SDD
converged: YES YES NO NO
title: Mulliken charges:
elementType: O O O O N C C C C C C C C C C C C C C C C C C H H H H H H H H H H H H H H H H H H H H H
charge: -0.227524 -0.189038 -0.263000 -0.262775 0.099453 0.297373 -0.469808 0.480533 0.503276 -0.713962 -0.739197 -0.412796 -0.434267 -0.375286 -0.369017 -0.361820 -0.356563 -0.380351 -0.401867 0.319741 0.315983 -0.537712 -0.537044 0.271454 0.248190 0.240342 0.226368 0.242015 0.210066 0.264907 0.253954 0.237461 0.234812 0.228084 0.252020 0.252273 0.237260 0.240404 0.245980 0.220302 0.220074 0.221431 0.220422 0.247848
chargesum: 0.00000
title: Mulliken charges with hydrogens summed into heavy atoms:
elementType: O O O O N C C C C C C C C C C C C C C C C C C
charge: -0.227524 -0.189038 -0.263000 -0.262775 0.099453 0.297373 -0.198354 0.480533 0.503276 0.000939 -0.022209 -0.158843 -0.196806 -0.140474 -0.140933 -0.109801 -0.104290 -0.143090 -0.161463 0.319741 0.315983 0.148645 0.152657
polarizability: 2.84633877e+02 -5.86490095e+00 2.01739840e+02 3.29953591e+00 -1.97735790e+01 1.78008788e+02
1716.lowfreq: -7.0635 -0.0010 -0.0009 -0.0009 3.2848 4.1934 24.2182 28.5375 41.4326
frequency: 24.1980 28.5062 41.3902 49.6047 51.2723 69.8585 89.7523 107.4566 114.3210 156.3395 165.6042 176.0184 185.3624 197.9849 231.7516 237.3664 244.5856 248.9044 254.8401 275.7679 298.7536 310.6198 344.8162 356.6198 357.2141 412.6355 417.1039 423.3176 440.3383 464.3238 497.4942 518.9343 520.4191 545.5923 566.8351 601.6321 628.5089 632.3104 671.6702 720.9342 731.4628 756.1543 763.0753 767.3410 776.9857 809.2835 813.8872 823.8735 840.7465 853.8667 877.7569 933.9895 935.4361 941.2249 959.8812 965.8223 974.6709 988.6489 989.8188 1002.7968 1004.5770 1009.0187 1112.3234 1112.6458 1112.9675 1116.9543 1126.4258 1156.4465 1157.7567 1177.6376 1179.2359 1180.6518 1188.4382 1195.2294 1211.7743 1227.2964 1232.7910 1237.2447 1268.3520 1305.1055 1320.4261 1327.8735 1375.2492 1379.9358 1395.3121 1401.8931 1407.2360 1419.3711 1424.1694 1436.8136 1437.0225 1460.6905 1462.8251 1466.7641 1467.6386 1472.4486 1473.0405 1477.2949 1482.2237 1500.1113 1502.6368 1579.7280 1581.1222 1621.3574 1624.2563 2957.5204 2959.5284 2997.9252 3005.8666 3011.8644 3044.5803 3047.3077 3096.1230 3105.3711 3113.5587 3117.6507 3124.6152 3126.3386 3127.4080 3131.5581 3141.7021 3144.3969 3162.8688 3164.7385 3168.4395 3169.0573
redmass: 4.2499 5.0916 3.7456 6.1134 3.5363 6.3027 5.1027 3.6915 3.8263 4.2841 4.0678 3.6762 3.1448 1.2646 1.3125 1.3598 1.4000 1.8831 2.9429 2.6466 3.4559 4.0927 4.9653 3.0919 4.2330 2.9791 3.4530 3.4220 4.6544 4.2184 4.6455 3.1008 3.5444 3.3537 3.7747 3.8532 6.7921 7.0813 5.2620 3.7609 3.9009 6.6070 7.2946 4.9799 3.3007 1.7141 1.4555 1.6848 1.6750 2.3031 3.7114 1.5736 1.4092 1.3576 1.7854 1.4729 1.3735 8.4663 8.5933 2.2906 2.6767 1.4190 1.3655 1.2618 1.2923 1.5277 1.5755 1.4234 1.3425 1.9426 1.7446 2.0940 1.4277 2.4346 3.0929 3.2656 3.1922 2.8216 1.8178 1.4118 1.4973 1.7211 2.9440 1.5137 2.5380 2.0526 2.3427 3.2435 2.3331 1.1752 1.1780 1.0587 1.0803 1.0501 1.0506 1.0791 1.0758 1.0558 1.0510 2.3602 2.3837 6.4691 6.8695 6.3656 6.3892 1.0331 1.0331 1.0357 1.0819 1.0363 1.1039 1.1039 1.0996 1.0985 1.1004 1.1003 1.0991 1.0992 1.0896 1.0896 1.0866 1.0865 1.0949 1.0946 1.0955 1.0956
irintensity: 0.4409 0.2001 1.5436 0.9768 2.1451 0.5038 0.5542 1.6565 7.2004 0.9799 7.8454 0.6727 4.5011 0.9643 0.3781 1.1963 0.5974 0.5856 0.0513 0.8601 1.1598 2.3783 1.5965 3.0624 1.6460 0.6432 0.6450 0.4390 0.5637 2.4488 2.1007 2.4233 14.1329 38.6585 32.7730 5.2330 0.8450 0.7167 5.1788 1.3615 0.1223 26.9578 12.2821 1.3827 22.0137 44.0552 14.9082 14.8153 40.7225 24.2446 9.0718 4.3584 0.5121 0.4707 1.9515 2.5846 1.0438 34.1524 38.7814 11.4480 11.1033 3.5536 1.4813 0.3896 0.7023 7.2047 26.0314 0.3940 0.5370 61.6861 54.5868 64.1556 41.2134 31.0195 33.3515 83.5780 200.3717 95.1955 7.7899 0.6417 1.5835 0.8951 33.6699 55.0508 60.9199 33.4863 12.9644 1.4495 3.4375 9.2907 14.2738 0.7554 3.7372 13.2823 15.1871 81.0347 49.3023 14.2650 19.2320 170.0513 62.4386 22.2106 11.4280 72.8391 48.0140 63.2601 70.7354 15.4060 4.4458 11.7917 48.1379 48.2421 13.9616 23.7287 6.7216 16.1984 29.2479 28.0976 8.4015 4.4050 18.5890 4.6755 6.0219 22.2660 3.8031 2.2726
temp: 298.150 k
press: 1.00000 atm
elementType: 8 8 8 8 7 6 6 6 6 6 6 6 6 6 6 6 6 6 6 6 6 6 6 1 1 1 1 1 1 1 1 1 1 1 1 1 1 1 1 1 1 1 1 1
symmnumber: 1
zpe: 926605.9 jmol-1
zpe.correction: 0.352926 hartree
zpe.thermalcorrener: 0.375754 hartree
zpe.thermalcorrenthalpy: 0.376698 hartree
zpe.thermalcorrgfe: 0.299728 hartree
zpe.sumelectzpe: -1052.352094 hartree
zpe.sumelectthermal: -1052.329266 hartree
zpe.sumelectthermalent: -1052.328322 hartree
zpe.sumelectthermalfe: -1052.405291 hartree
dipole: 3.8482 -4.1439 3.7972
dipole: 6.8117
quadrupole: -131.7809 -133.6013 -130.4119
quadrupole: 11.2147 5.5479 -6.8354
quadrupole: 0.1505 -1.6699 1.5195 11.2147 5.5479 -6.8354
hfenergy: -1052.7050198 hartree
pointgroup: C01 [X(C18H21N1O4)]
dipole: 1.4596465 1.5294753 -1.646888 debye
polarizability: 284.2819964|5.3524575|198.9469854|-6.6621544|-21.4040983|181.1535233 unknown
InChI: InChI=1S/C18H21NO4/c1-18(2,19(20)21)17(13-5-9-15(22-3)10-6-13)14-7-11-16(23-4)12-8-14/h5-12,17H,1-4H3
charge 0 multiplicity 1
44 atoms
O  -1.20001 -3.327731 1.411152
O  -2.34569 -3.294169 -0.54687
O  -4.633414 2.499979 0.199164
O  5.225663 1.667342 0.171362
N  -1.319827 -3.010834 0.166654
C  -0.110363 -2.225891 -0.490264
C  0.045644 -0.912851 0.401074
C  -1.162536 0.035437 0.291718
C  1.40996 -0.232433 0.236393
C  1.108327 -3.162209 -0.319147
C  -0.457841 -1.997811 -1.966902
C  -2.279794 -0.171092 1.150605
C  2.200995 -0.03637 1.403447
C  -1.226491 1.121308 -0.613524
C  1.940826 0.240243 -0.990135
C  -3.413381 0.657384 1.096207
C  3.455123 0.595983 1.355744
C  -2.357895 1.965789 -0.684747
C  3.202623 0.87393 -1.063153
C  -3.459945 1.730442 0.172721
C  3.964897 1.055083 0.116303
C  -4.727104 3.620937 -0.737986
C  5.7929 2.163614 -1.084545
H  0.034742 -1.314201 1.432464
H  1.301987 -3.367203 0.746626
H  2.000203 -2.682362 -0.753489
H  0.937831 -4.121332 -0.8398
H  -0.738938 -2.948812 -2.448519
H  0.427427 -1.602193 -2.491432
H  -1.296193 -1.294152 -2.087625
H  -2.260343 -0.991389 1.877822
H  1.820201 -0.384877 2.370949
H  -0.375676 1.340998 -1.265138
H  1.378987 0.11862 -1.921371
H  -4.2692 0.495138 1.758172
H  4.055023 0.743781 2.258698
H  -2.361671 2.796758 -1.396744
H  3.571425 1.219639 -2.03362
H  -5.713634 4.069939 -0.551343
H  -4.668009 3.27448 -1.788412
H  -3.934527 4.371591 -0.550091
H  5.150938 2.945478 -1.535271
H  5.943608 1.341744 -1.811553
H  6.765453 2.596772 -0.808996
