program: Gaussian 09
title: 000158756
version: EM64L-G09RevD.01
frameworkgroup: C1[X(C12H17ClF3N3O6S)]
method: RPBEPBE
basis: SDD
operation: Freq
keyword: #p
keyword: freq=noraman
keyword: PBEPBE/SDD
title: #p freq=noraman PBEPBE/SDD
converged: NO YES NO NO
title: Mulliken charges:
elementType: Cl S F F F O O O O O O N N N C C C C C C C C C C C C H H H H H H H H H H H H H H H H H
charge: 0.044657 0.269357 -0.145480 -0.173033 -0.144641 -0.293083 -0.270881 -0.418050 -0.239982 -0.453137 -0.208825 -0.397492 -0.381339 -0.654374 -0.148911 -0.374808 -0.549367 -0.717139 -0.095567 0.253658 0.217728 0.165615 0.088355 -0.386825 -0.225334 0.185066 0.286323 0.249396 0.226734 0.218923 0.264923 0.279523 0.342902 0.357713 0.209989 0.360868 0.316137 0.279807 0.284175 0.296413 0.295783 0.385534 0.398688
chargesum: 0.00000
title: Mulliken charges with hydrogens summed into heavy atoms:
elementType: Cl S F F F O O O O O O N N N C C C C C C C C C C C C
charge: 0.044657 0.269357 -0.145480 -0.173033 -0.144641 -0.293083 -0.270881 -0.032516 -0.239982 -0.054449 -0.208825 -0.039779 -0.020471 -0.058430 0.137412 0.101322 -0.065521 -0.094715 0.114423 0.253658 0.217728 0.165615 0.088355 0.193764 0.070448 0.185066
polarizability: 2.53332530e+02 -1.49261423e+01 1.65915647e+02 5.58958626e+00 1.28051376e+01 1.76341777e+02
1716.lowfreq: -5.9086 -0.0017 -0.0013 -0.0010 3.7418 4.9793 11.1669 14.1516 15.7570
frequency: 10.9172 13.2840 15.5404 25.8574 27.7404 34.4944 37.6065 42.3972 49.0180 62.7726 75.1161 80.9285 90.7576 92.1912 113.4376 134.1645 141.8806 156.5086 181.7040 192.9428 204.6335 226.2151 230.9759 235.6481 270.6251 274.1590 289.0048 300.8313 307.9447 322.4942 341.9185 366.0964 374.9095 396.1111 401.5689 428.7343 446.3283 486.0641 494.2016 508.9785 520.9804 538.9183 543.5259 561.1784 582.5259 602.9698 609.5836 627.5178 642.6189 648.1234 684.5535 698.6718 715.8837 718.0191 757.0875 762.5193 777.4449 817.9683 821.0358 882.8969 897.6138 910.8653 930.0418 941.7978 970.8298 979.0608 981.8302 1013.5137 1037.3797 1053.4024 1061.9123 1078.3646 1095.5169 1118.4218 1122.8529 1139.1010 1149.1277 1175.8374 1193.2745 1219.7643 1226.9531 1229.2576 1231.4297 1234.3925 1258.7840 1268.2188 1283.9333 1293.0529 1298.7872 1309.5606 1319.1646 1325.2764 1340.4240 1356.0161 1379.0026 1441.2229 1449.7628 1454.8351 1468.4423 1470.9998 1504.3589 1588.1798 1600.5552 1622.0748 1664.1533 1690.8732 2830.9045 2952.9898 2976.7679 3003.4766 3009.5999 3045.8866 3047.1298 3061.7209 3084.2851 3122.0129 3122.6603 3459.8282 3508.7650 3513.7181 3538.9073 3542.4193 3660.3106
redmass: 8.9720 9.0184 5.5116 13.1388 7.3588 10.1097 11.4029 8.5042 10.6747 10.3785 8.1076 5.5608 10.0718 8.5255 3.1865 6.5724 4.9912 4.0709 3.8680 5.5387 3.9265 11.2218 2.3269 2.0131 4.3582 13.0974 12.0406 6.2488 5.3224 3.2108 3.8355 8.5561 12.9330 4.2008 13.4729 1.6483 2.4766 2.2493 3.0162 4.2570 10.2087 4.0922 4.3192 2.8621 4.5903 1.4833 1.9165 2.8064 1.9828 1.9128 3.3630 1.2940 7.6316 2.0690 6.6687 2.9264 4.5963 2.1964 3.7255 3.3310 4.5998 4.0610 9.1768 4.6464 8.9671 2.0278 2.1761 2.4323 2.9381 3.1910 2.8644 2.1172 3.3849 2.1979 3.2306 1.5442 1.4090 1.4119 2.1054 1.1130 1.2028 1.5432 1.6692 1.3717 1.2124 1.6255 1.3250 1.2450 1.7180 1.7473 1.2632 1.3603 1.6299 1.7352 1.8640 1.1015 1.0937 1.0767 1.0959 2.4633 2.1229 7.3768 1.3299 7.0803 3.7571 9.3365 1.0788 1.0813 1.0658 1.0599 1.0601 1.0998 1.0585 1.0969 1.1006 1.1053 1.0890 1.0780 1.0638 1.0453 1.0649 1.0779 1.1009
irintensity: 0.0170 0.0427 0.3442 1.0746 0.8466 1.0762 0.8828 0.7431 4.5989 0.0561 3.1150 0.2484 2.5677 3.0527 4.6049 3.8841 3.8850 13.5671 7.5248 2.9088 6.2317 1.3105 12.1167 19.7851 4.7618 0.3271 1.8632 2.3733 6.4450 19.3154 23.0344 9.3828 2.3918 21.0144 6.2938 120.3658 121.9151 58.7319 23.8829 11.6823 17.6686 0.7638 45.6292 11.3453 13.0988 27.4066 63.3951 12.7451 34.2534 298.4221 38.1690 57.3393 56.1061 46.3416 99.1236 10.6704 1.0327 3.8242 15.8468 24.0695 255.3253 13.7590 84.1577 6.1970 67.3001 1.3494 3.2705 6.8172 1.3447 191.0550 67.0231 226.7057 20.5154 34.2024 23.6112 3.3055 0.6466 15.0320 8.2698 0.6424 4.6399 10.6687 11.3035 11.1737 9.3591 12.6510 22.9114 3.8391 23.7583 39.2799 17.0138 2.7104 12.7341 22.1155 2.0716 45.7046 7.0152 19.0601 18.1519 800.7011 166.8381 175.1755 186.9667 93.1063 170.1424 268.0591 68.3721 16.5679 12.1124 21.3283 15.7737 1.7587 11.4669 3.2444 26.1558 3.6625 4.9577 116.7795 27.2306 14.9597 24.2659 89.5090 16.9756
temp: 298.150 k
press: 1.00000 atm
elementType: 17 16 9 9 9 8 8 8 8 8 8 7 7 7 6 6 6 6 6 6 6 6 6 6 6 6 1 1 1 1 1 1 1 1 1 1 1 1 1 1 1 1 1
symmnumber: 1
zpe: 800674.5 jmol-1
zpe.correction: 0.304961 hartree
zpe.thermalcorrener: 0.334446 hartree
zpe.thermalcorrenthalpy: 0.335390 hartree
zpe.thermalcorrgfe: 0.237196 hartree
zpe.sumelectzpe: -2238.727508 hartree
zpe.sumelectthermal: -2238.698023 hartree
zpe.sumelectthermalent: -2238.697079 hartree
zpe.sumelectthermalfe: -2238.795273 hartree
dipole: 0.5037 -2.3316 -2.5801
dipole: 3.5139
quadrupole: -173.9771 -164.3435 -165.4201
quadrupole: 4.9972 -21.5426 1.3436
quadrupole: -6.0635 3.5701 2.4934 4.9972 -21.5426 1.3436
hfenergy: -2239.0324687 hartree
pointgroup: C01 [X(C12H17Cl1F3N3O6S1)]
dipole: 0.1839658 -0.5928645 -1.2352551 debye
polarizability: 254.6040273|-11.0952401|158.6378271|-1.617915|8.5545334|182.3480989 unknown
InChI: InChI=1S/C12H17ClF3N3O6S/c13-11(14)12(15,16)26-4-6(9(23)18-3-8(21)22)19-7(20)2-1-5(17)10(24)25/h5-6,11,18-19,21,24H,1-4,17H2
charge 0 multiplicity 1
43 atoms
Cl 1.889117 3.90445 1.930362
S  0.644624 1.659724 -0.195208
F  2.979568 0.991451 1.123937
F  3.243774 1.519442 -1.072702
F  4.231718 3.418733 0.709915
O  -2.169705 -0.884705 -2.181014
O  1.032091 -1.944704 1.328155
O  -5.121044 -0.673893 2.338324
O  -7.042702 0.575271 2.009313
O  5.011014 -1.732804 -1.431877
O  6.168086 -2.443909 0.459545
N  -0.979355 -1.181804 -0.21824
N  2.652032 -1.741007 -0.317714
N  -6.913253 0.326556 -0.702501
C  0.318995 -1.13863 -0.886358
C  -4.493028 -0.181996 -0.491883
C  -3.440241 -1.241613 -0.096276
C  0.625277 0.259353 -1.481228
C  -5.93144 -0.450311 0.047465
C  -2.163175 -1.085101 -0.920962
C  1.365592 -1.639952 0.139702
C  -6.110847 -0.105392 1.526971
C  2.479699 1.860443 0.103352
C  3.736214 -2.124154 0.589537
C  2.83638 3.323801 0.441519
C  5.0944 -2.131479 -0.086803
H  0.299298 -1.82821 -1.759045
H  -4.561793 -0.167063 -1.595167
H  -4.173513 0.830367 -0.184117
H  -3.849572 -2.250622 -0.312695
H  -3.229734 -1.206815 0.985338
H  1.577056 0.293312 -2.034685
H  -0.197671 0.527528 -2.16352
H  -0.942383 -1.395245 0.786965
H  -6.096221 -1.559258 -0.006221
H  2.916818 -1.466528 -1.266717
H  -7.721783 0.661138 -0.176184
H  -7.082279 0.039432 -1.664768
H  3.555193 -3.126951 1.020583
H  3.784152 -1.428593 1.449425
H  2.585419 3.993438 -0.393662
H  -5.310839 -0.440552 3.287818
H  5.916462 -1.719449 -1.841982
