program: Gaussian 09
title: 000158668
version: EM64L-G09RevD.01
frameworkgroup: C1[X(C14H8ClF4N3O4)]
method: RPBEPBE
basis: SDD
operation: Freq
keyword: #p
keyword: freq=noraman
keyword: PBEPBE/SDD
title: #p freq=noraman PBEPBE/SDD
converged: YES YES NO NO
title: Mulliken charges:
elementType: Cl F F F F O O O O N N N C C C C C C C C C C C C C C H H H H H H H H
charge: -0.013264 -0.151342 -0.151086 -0.143863 -0.188007 -0.172645 -0.200135 -0.193586 -0.192831 -0.236496 0.003960 0.017493 0.260347 0.205787 0.269501 0.559292 -0.531820 -0.530747 0.468194 -0.650131 0.257950 -0.309596 -0.248651 -0.386982 -0.379867 0.356952 0.327698 0.334583 0.247335 0.273025 0.263894 0.276130 0.288985 0.269923
chargesum: 0.00000
title: Mulliken charges with hydrogens summed into heavy atoms:
elementType: Cl F F F F O O O O N N N C C C C C C C C C C C C C C
charge: -0.013264 -0.151342 -0.151086 -0.143863 -0.188007 -0.172645 -0.200135 -0.193586 -0.192831 -0.236496 0.003960 0.017493 0.260347 0.205787 0.269501 0.559292 -0.204122 -0.196164 0.468194 0.134122 0.257950 -0.309596 0.027480 -0.097998 -0.109944 0.356952
polarizability: 3.49422854e+02 2.13111679e+00 1.92992245e+02 1.15273680e+00 4.77847048e+00 1.57213402e+02
1716.lowfreq: -8.1248 -6.0311 -0.0021 -0.0018 -0.0014 4.1811 17.7468 36.2114 49.6449
frequency: 17.5942 36.1744 49.6363 56.9716 60.3178 72.1518 80.8199 103.1246 129.3328 137.5838 145.0177 153.5637 165.0064 179.0124 203.8730 239.4793 250.1778 256.0879 281.3781 286.0713 303.7115 311.8243 330.1626 338.1523 355.1785 407.3594 409.2611 423.0147 446.9112 454.7887 468.0334 486.9885 516.1114 530.1362 547.2568 566.3146 579.1970 608.5299 630.4291 641.3723 665.3717 683.6860 691.1919 706.9244 708.2450 714.9536 752.9739 807.7440 815.7234 826.4550 859.6873 874.1163 898.6251 945.3832 959.0626 963.7424 992.4561 1014.3883 1016.0291 1046.6067 1053.8579 1109.7716 1114.4440 1127.4046 1139.5548 1170.7933 1183.0075 1194.9725 1214.5597 1249.7704 1260.2862 1264.8932 1332.0903 1357.1166 1361.4058 1366.9276 1381.3875 1396.6326 1419.8928 1436.0314 1463.5514 1475.2362 1476.5668 1492.9362 1573.8646 1579.7781 1601.5787 1606.3664 2990.5855 3090.8758 3115.9022 3162.1798 3185.6851 3187.6570 3189.2318 3189.5780
redmass: 13.4764 12.9714 13.9308 14.2026 10.8364 13.5972 10.2895 7.8884 7.7913 10.6475 17.6193 9.1044 7.4043 5.8258 4.4584 2.8879 7.5027 1.5789 10.9573 10.7786 6.8662 7.2791 10.7513 6.0874 7.4465 6.8176 6.4646 8.0056 6.3762 5.7485 7.8605 7.7601 8.3337 5.7285 4.9823 7.8657 3.9932 10.4843 7.1431 6.4479 7.5769 9.3938 7.6598 7.8782 4.1455 12.5640 7.9111 2.6577 3.1090 3.7878 1.4918 8.1293 6.6200 1.3666 1.6663 1.4466 5.0567 7.1747 4.0665 4.2833 5.3799 1.3076 1.9833 1.5017 1.3297 2.6674 3.5364 10.6120 3.3096 4.3255 1.9742 2.3991 3.6040 5.7285 8.4797 7.5365 10.1683 4.4354 2.9047 1.9033 1.8702 2.7120 1.2327 1.2229 9.3389 8.6890 7.1606 7.2140 1.0354 1.0995 1.1017 1.0899 1.0927 1.0951 1.0955 1.0921
irintensity: 0.2535 0.4775 0.3129 0.1489 1.5037 0.7867 3.2257 3.5793 0.6765 3.3632 0.2064 4.6297 1.3188 1.3384 2.9388 0.6604 2.7436 0.5008 0.5080 0.9263 0.3774 1.8239 1.3221 1.6071 1.2341 5.0103 0.8779 2.8746 17.7578 6.0274 5.0357 10.2302 1.5842 7.1599 5.1017 9.0618 9.8947 15.6158 4.1900 24.8520 4.6577 15.5587 19.3618 12.3507 2.5488 26.2324 0.8857 30.2474 10.1756 14.9981 40.2062 29.3924 18.8546 2.4860 97.3692 2.4163 127.5839 153.7649 20.9548 3.3360 97.8253 4.5520 68.5157 83.2189 33.2547 100.3777 41.6043 420.9122 437.6096 8.5894 50.0546 64.1646 25.1271 14.7075 108.7208 82.9312 25.1577 5.2289 47.0568 26.1810 145.0508 82.2249 31.6783 113.4632 53.2429 31.7305 63.7897 228.7397 27.9783 6.8217 2.4075 0.7996 21.5615 1.9992 0.8696 15.8546
temp: 298.150 k
press: 1.00000 atm
elementType: 17 9 9 9 9 8 8 8 8 7 7 7 6 6 6 6 6 6 6 6 6 6 6 6 6 6 1 1 1 1 1 1 1 1
symmnumber: 1
zpe: 548594.6 jmol-1
zpe.correction: 0.208949 hartree
zpe.thermalcorrener: 0.232068 hartree
zpe.thermalcorrenthalpy: 0.233012 hartree
zpe.thermalcorrgfe: 0.155067 hartree
zpe.sumelectzpe: -1860.816129 hartree
zpe.sumelectthermal: -1860.793010 hartree
zpe.sumelectthermalent: -1860.792066 hartree
zpe.sumelectthermalfe: -1860.870011 hartree
dipole: 3.6603 1.3824 0.6741
dipole: 3.9702
quadrupole: -183.5421 -171.9197 -148.4610
quadrupole: 1.1027 0.7932 2.9229
quadrupole: -15.5678 -3.9455 19.5133 1.1027 0.7932 2.9229
hfenergy: -1861.0250779 hartree
pointgroup: C01 [X(C14H8Cl1F4N3O4)]
dipole: 1.4797924 -0.1316891 -0.4824498 debye
polarizability: 346.1706997|23.3191058|183.9635427|-3.1940144|17.3607748|169.4942594 unknown
InChI: InChI=1S/C14H8ClF4N3O4/c1-20(11-3-2-7(16)4-10(11)15)13-9(14(17,18)19)5-8(21(23)24)6-12(13)22(25)26/h2-6H,1H3
charge 0 multiplicity 1
34 atoms
Cl 2.998972 1.762768 -2.18171
F  -0.925542 3.166633 1.132193
F  0.788202 1.816437 1.690755
F  0.595628 2.606133 -0.43281
F  5.380029 0.249815 2.132428
O  -1.877543 -3.246679 -2.01413
O  0.062318 -3.065678 -0.824898
O  -5.02158 1.123463 1.366432
O  -5.494072 -0.823268 0.262295
N  0.766407 -0.266264 -1.089819
N  -1.063073 -2.593891 -1.257958
N  -4.680925 0.098233 0.658513
C  -0.50946 -0.218845 -0.512106
C  -0.99722 0.896912 0.277104
C  -1.479172 -1.25321 -0.77856
C  1.947827 -0.067609 -0.286236
C  -2.344979 0.96858 0.664733
C  -2.840298 -1.150995 -0.451195
C  -3.260914 -0.029171 0.274012
C  0.976005 -0.887704 -2.424562
C  -0.144084 2.090506 0.653058
C  3.037022 0.762087 -0.666072
C  2.066289 -0.819662 0.914751
C  4.18823 0.87079 0.135068
C  3.196819 -0.716116 1.743952
C  4.236544 0.133329 1.330146
H  -2.716735 1.824977 1.232298
H  -3.540516 -1.950608 -0.707109
H  0.030554 -0.884148 -2.990661
H  1.351634 -1.922707 -2.334661
H  1.705532 -0.278752 -2.980214
H  1.25617 -1.507189 1.174444
H  5.018954 1.520676 -0.149783
H  3.284175 -1.288543 2.6707
