program: Gaussian 09
title: 000158649
version: EM64L-G09RevD.01
frameworkgroup: C1[X(C9H11ClFNO)]
method: RPBEPBE
basis: SDD
operation: Freq
keyword: #p
keyword: freq=noraman
keyword: PBEPBE/SDD
title: #p freq=noraman PBEPBE/SDD
converged: YES YES NO NO
title: Mulliken charges:
elementType: Cl F O N C C C C C C C C C H H H H H H H H H H H
charge: -0.036082 -0.222470 -0.265961 -0.691478 0.023727 0.583009 -0.688742 -0.690488 -0.511617 -0.365133 0.334793 -0.332098 0.156929 0.193935 0.202174 0.237695 0.230625 0.212643 0.242488 0.234884 0.237351 0.274717 0.308303 0.330798
chargesum: 0.00000
title: Mulliken charges with hydrogens summed into heavy atoms:
elementType: Cl F O N C C C C C C C C C
charge: -0.036082 -0.222470 -0.265961 -0.052378 0.217662 0.583009 -0.018248 -0.000473 -0.274266 -0.365133 0.334793 -0.057381 0.156929
polarizability: 1.56745618e+02 1.15294766e+01 1.40378415e+02 -1.02797228e+00 2.88737951e+00 6.53157973e+01
1716.lowfreq: -4.2682 -0.0029 -0.0026 -0.0022 4.0994 8.0495 45.0401 71.4177 104.8996
frequency: 45.0289 71.3634 104.8962 112.6979 170.0893 184.2055 192.4921 231.3362 258.3510 271.6715 294.9471 307.4106 326.8493 367.8046 374.0253 393.2845 426.7167 440.2263 455.6033 531.0819 555.7328 617.6010 647.3364 689.1057 712.2156 781.0314 814.8080 831.0755 843.3511 908.3692 927.4613 941.9960 997.0656 1048.8558 1105.1382 1140.8141 1150.8453 1178.8550 1186.3465 1244.4944 1314.2336 1331.1769 1349.2130 1380.8102 1385.3469 1398.2609 1414.8638 1455.1755 1468.2270 1469.1962 1489.9547 1506.8401 1596.6888 1616.8030 1642.2430 2973.8909 2989.9070 2996.2062 3085.9079 3095.0045 3098.0182 3106.2559 3158.9734 3183.3435 3573.5118 3716.9250
redmass: 4.3647 3.2259 5.4201 4.0107 7.8217 1.1093 3.9343 1.1758 5.4561 5.0553 3.5380 3.8271 1.3965 5.1190 4.8089 3.2812 1.9382 2.6367 1.4231 5.2520 4.0303 6.4369 11.4190 2.3483 4.7812 5.4083 2.0307 3.5849 1.3704 2.9357 1.2973 1.3057 2.9238 1.7385 1.7384 3.4158 2.1435 1.9448 2.3001 1.4440 1.3521 3.5597 1.4681 1.2486 6.6513 1.2688 4.8073 1.0513 1.0533 1.0485 1.0516 4.4712 8.3587 1.8024 2.2623 1.0840 1.0359 1.0362 1.0991 1.1002 1.0998 1.1004 1.0901 1.0930 1.0448 1.1045
irintensity: 0.3551 0.2424 2.1331 0.7850 0.7154 0.2210 0.4788 0.0543 0.0303 3.4052 3.7014 1.1649 121.5833 23.3220 22.1434 6.7693 91.2294 5.7349 69.8447 0.7841 0.1972 9.4231 1.1139 0.5585 11.5761 47.2592 28.4069 29.9905 40.9930 22.2296 4.6450 0.4869 37.1096 18.6285 76.8122 123.5572 19.3854 39.3077 98.8037 103.4224 33.2167 8.1540 5.6284 30.7717 26.7090 19.0517 74.4743 4.9839 6.2297 2.1018 14.6006 279.2797 17.4686 12.0313 285.3918 31.8987 15.6179 21.8177 18.6062 24.0240 32.6252 32.0275 9.9713 0.4936 101.0012 33.9165
temp: 298.150 k
press: 1.00000 atm
elementType: 17 9 8 7 6 6 6 6 6 6 6 6 6 1 1 1 1 1 1 1 1 1 1 1
symmnumber: 1
zpe: 482570.9 jmol-1
zpe.correction: 0.183802 hartree
zpe.thermalcorrener: 0.197574 hartree
zpe.thermalcorrenthalpy: 0.198518 hartree
zpe.thermalcorrgfe: 0.143480 hartree
zpe.sumelectzpe: -1038.448812 hartree
zpe.sumelectthermal: -1038.435040 hartree
zpe.sumelectthermalent: -1038.434096 hartree
zpe.sumelectthermalfe: -1038.489134 hartree
dipole: 1.1592 -5.1421 -0.2127
dipole: 5.2755
quadrupole: -78.9255 -73.8217 -85.9839
quadrupole: -0.6798 0.2206 1.3547
quadrupole: 0.6515 5.7553 -6.4068 -0.6798 0.2206 1.3547
hfenergy: -1038.6326137 hartree
pointgroup: C01 [X(C9H11Cl1F1N1O1)]
dipole: -0.5180527 -1.9573867 0.4561817 debye
dipolederiv: -0.1895064 0.2257318 -0.0299307 0.2464407 -0.6231624 0.0946319 -0.0334556 0.0997527 -0.0633869 -1.1305469 0.0692907 0.1276088 0.0677906 -0.2212282 0.0104166 0.1421867 0.0093229 -0.1564091 -1.8219708 -0.3061238 0.2235293 -0.2317172 -0.3251554 -0.0214754 0.335872 0.0150878 -0.3527154 -0.541583 0.53817 -0.1647648 0.6847159 -1.2301987 0.0220539 -0.1933809 0.0292159 -0.7056292 0.9429068 0.2214125 -0.0768922 0.557831 0.4604663 -0.0371938 -0.1747112 0.0208395 0.4501801 1.525454 0.2225289 -0.1844029 -0.0064908 0.0272433 0.0096995 -0.2426528 -0.0287828 0.1853607 -0.112934 0.0302085 0.0531057 0.0100016 0.018169 -0.0587059 0.0644764 -0.0487801 0.0035383 -0.0827093 -0.0001041 0.0026495 -0.1266196 -0.0480463 -0.077522 0.0018921 -0.1363981 -0.1281998 -0.4120487 0.2108751 -0.0274647 0.2078016 -0.2014763 -0.0229022 -0.0257197 -0.0459858 -0.2530764 -0.2569236 -0.2747944 0.0559756 -0.545722 0.7429472 -0.1345516 0.1295156 -0.1644266 -0.1544597 0.3689442 -0.468313 0.0828479 -0.8657467 1.2754285 -0.1554706 0.1717376 -0.1971673 0.1625033 0.1242022 -0.0891028 -0.0004146 -0.1022763 -0.0791107 0.0143918 -0.004432 0.016964 -0.0551056 1.0727237 -0.2019767 -0.1197132 0.351393 -0.2191526 -0.0018285 -0.2603936 0.0806795 -0.0177218 -0.0685911 0.0633428 -0.0958074 -0.0416076 -0.0658632 0.0887053 -0.0483376 0.0628264 -0.0829999 -0.0605072 -0.0906545 0.0529858 -0.134096 -0.0398587 0.0518462 0.0501049 0.0298142 0.0927078 0.0950303 -0.0213398 -0.0519952 0.0132491 0.0303653 -0.1183169 -0.0324 -0.1026752 -0.0666239 0.0636252 0.0412759 -0.031092 0.0923281 0.0276106 0.0656484 -0.0826295 0.1025086 -0.0206242 -0.0275261 -0.1281201 0.0225402 -0.164331 -0.0472578 0.0336396 0.0145146 0.0494125 0.0714954 -0.0383063 0.0937728 0.0997217 0.1046113 0.06353 -0.0482873 0.0959962 -0.0286394 0.0312514 0.0504201 0.0352966 -0.0784668 0.0953577 0.0146881 0.097186 -0.0656561 0.043281 -0.0012027 0.0529028 -0.0557361 0.0318605 -0.0851481 -0.0553343 0.0574739 0.0452096 0.061604 0.1489763 0.0765717 -0.0432345 0.0252981 -0.0492496 0.0552841 0.0372379 0.0282669 0.0362036 0.1665057 0.1336525 -0.0069086 0.0419668 -0.0495096 0.2331968 0.0434008 0.0535327 0.0393743 0.3677408 0.2367198 -0.0654972 0.0408546 -0.0290063 0.2069154 0.0499224 0.0304637 0.0559686 0.3778947 unknown
polarizability: 154.4754138|-13.9552754|138.9555566|-9.1213099|-12.9743505|69.0088593 unknown
InChI: InChI=1S/C9H11ClFNO/c1-5(2)13-9-4-8(12)7(11)3-6(9)10/h3-5H,12H2,1-2H3
charge 0 multiplicity 1
24 atoms
Cl -0.426679 3.045179 -0.557981
F  3.767767 -0.063082 -0.477078
O  -1.767009 0.53686 0.275982
N  2.312355 -2.285803 0.279898
C  -2.673077 -0.602977 0.600203
C  -0.403403 0.31098 0.085061
C  -3.922072 0.053572 1.196547
C  -2.970909 -1.419411 -0.669782
C  0.243156 -0.936968 0.278142
C  0.373294 1.435715 -0.304876
C  1.645978 -1.079191 0.09655
C  1.762419 1.321667 -0.49343
C  2.366359 0.078445 -0.290564
H  -2.183404 -1.234665 1.370593
H  -4.660915 -0.71782 1.479288
H  -3.662591 0.642149 2.092474
H  -4.384105 0.732445 0.459044
H  -3.637753 -2.26802 -0.430187
H  -2.051057 -1.820585 -1.128623
H  -3.47528 -0.779665 -1.414813
H  -0.334475 -1.816142 0.577418
H  2.364728 2.183197 -0.79206
H  1.81484 -3.123114 0.563691
H  3.317232 -2.331165 0.137503
