program: Gaussian 09
title: 000158646
version: EM64L-G09RevD.01
frameworkgroup: C1[X(C6H12Cl2NPS)]
method: RPBEPBE
basis: SDD
operation: Freq
keyword: #p
keyword: freq=noraman
keyword: PBEPBE/SDD
title: #p freq=noraman PBEPBE/SDD
converged: NO YES NO NO
title: Mulliken charges:
elementType: Cl Cl S P N C C C C C C H H H H H H H H H H H H
charge: -0.149699 -0.165744 -0.129228 0.438069 -0.686107 0.008717 -0.385139 -0.430424 -0.394006 -0.392638 -0.390322 0.250799 0.192829 0.224237 0.232296 0.188172 0.210984 0.201547 0.202586 0.209501 0.208527 0.193806 0.361238
chargesum: 0.00000
title: Mulliken charges with hydrogens summed into heavy atoms:
elementType: Cl Cl S P N C C C C C C
charge: -0.149699 -0.165744 -0.129228 0.438069 -0.324869 0.259516 0.031927 -0.009956 0.018525 0.019448 0.012010
polarizability: 1.55426092e+02 -9.71620553e-01 1.25542951e+02 -9.10407171e+00 3.22390541e+00 1.33038190e+02
1716.lowfreq: -32.8301 -12.3691 -6.3428 -0.0027 -0.0019 0.0010 14.3372 22.3519 64.4594
frequency: -17.2618 20.4445 64.3344 107.7590 119.9489 145.0834 157.4265 182.8589 215.9812 238.2197 291.3676 319.5803 371.0366 379.0626 417.2648 430.7327 464.4944 490.0574 521.5037 595.1524 782.4821 787.6186 831.4388 870.2968 885.1801 896.2025 918.2366 980.9186 1043.5176 1051.2006 1071.9535 1079.1595 1108.4233 1142.3964 1190.9315 1232.9457 1252.7724 1256.1281 1285.6283 1306.9692 1325.7296 1333.5203 1337.3454 1342.4245 1351.4525 1388.7097 1456.5983 1462.1707 1463.7220 1470.7878 1477.2900 2961.7935 2971.5380 2974.9717 2976.3127 2976.9025 2998.7761 3037.6176 3038.9413 3044.2734 3047.8609 3055.6798 3509.8087
redmass: 5.3792 3.9506 5.6859 11.0642 6.8274 5.2654 11.0370 12.9369 1.8064 6.7586 3.3341 1.9216 6.1121 7.3468 2.3087 2.3617 3.9991 1.8046 2.0028 8.0671 1.4841 2.1581 2.5240 3.6906 1.6429 1.5917 1.9142 2.6902 1.8437 1.2131 2.0027 2.1585 2.5068 2.2760 1.4828 1.3029 1.2540 1.2863 1.1944 1.2847 1.4020 1.3660 1.4258 1.4609 1.4097 1.2290 1.0895 1.0900 1.0867 1.0808 1.0954 1.0659 1.0659 1.0650 1.0603 1.0620 1.0820 1.0970 1.0956 1.1018 1.0996 1.1023 1.0762
irintensity: 0.2823 0.3500 1.2063 1.1028 0.5598 2.9338 6.4078 0.5831 0.2508 5.0219 4.4858 4.1753 40.2183 40.9626 4.0212 20.2326 11.5565 151.4269 18.9028 75.6430 0.8829 3.6148 8.0249 47.1409 13.4553 26.8788 1.4918 4.5955 3.1962 5.1524 54.3630 68.3794 0.3005 11.6710 8.2352 7.1173 4.1364 1.9921 11.5864 0.7890 1.0112 3.7273 8.0163 1.0055 0.8354 33.3530 4.2850 7.4807 9.0700 24.1319 1.2532 21.3544 30.8211 19.1810 43.1941 8.0625 15.7743 59.0262 61.7866 3.7466 13.1196 89.7067 52.7542
temp: 298.150 k
press: 1.00000 atm
elementType: 17 17 16 15 7 6 6 6 6 6 6 1 1 1 1 1 1 1 1 1 1 1 1
symmnumber: 1
zpe: 469599.7 jmol-1
zpe.correction: 0.178861 hartree
zpe.thermalcorrener: 0.191474 hartree
zpe.thermalcorrenthalpy: 0.192418 hartree
zpe.thermalcorrgfe: 0.137891 hartree
zpe.sumelectzpe: -1949.143402 hartree
zpe.sumelectthermal: -1949.130789 hartree
zpe.sumelectthermalent: -1949.129845 hartree
zpe.sumelectthermalfe: -1949.184371 hartree
dipole: -5.6036 -1.1534 -1.1117
dipole: 5.8280
quadrupole: -100.0634 -99.4166 -97.1890
quadrupole: -0.1453 0.4361 2.0003
quadrupole: -1.1738 -0.5269 1.7007 -0.1453 0.4361 2.0003
hfenergy: -1949.3222627 hartree
pointgroup: C01 [X(C6H12Cl2N1P1S1)]
dipole: 2.2296622 -0.3688236 0.3874309 debye
dipolederiv: -0.5509433 -0.2632609 0.1527972 -0.3247842 -0.5618639 0.229021 0.2643626 0.2657792 -0.4349467 -0.4706958 0.1542533 0.0537944 0.3463169 -0.7797344 -0.2714797 0.1885205 -0.343796 -0.453008 -0.3284714 -0.0040342 0.0848173 0.000284 -0.247326 -0.0016306 -0.0416326 0.0020357 -0.6090732 1.7731456 0.0502289 -0.2312153 -0.1068032 1.5917054 0.0153358 -0.0109469 0.0322561 1.6371363 -1.1855496 -0.0572079 0.0268776 -0.0532672 -0.6131167 0.0200494 -0.2665929 0.0525789 -0.5054692 0.753507 0.0755686 0.0122822 0.3070518 0.208245 -0.0072962 -0.3759328 0.0676659 0.0936223 -0.0943964 -0.0083513 0.0140711 -0.0213978 -0.0476823 0.0126928 0.0857527 0.0040228 0.1494113 -0.1573649 0.0061421 0.0361418 -0.1782609 0.078411 0.0291819 0.1924037 -0.0378332 0.1743277 0.0831606 0.0252296 0.0072204 -0.0544994 0.0717621 0.0154336 -0.0515644 -0.0117978 0.1303482 0.1073277 -0.0126015 0.0085345 0.1229431 0.033444 -0.0026317 -0.1227422 0.0424504 0.1353765 0.0517971 -0.0022094 -0.008454 -0.0033567 0.0384745 0.0105127 0.0575479 0.0161759 0.148396 0.0425716 0.0043428 -0.0357576 -0.0242388 0.0329225 0.0013053 0.0155578 -0.0317546 -0.0760548 0.0587164 -0.0260317 0.0019696 -0.019432 0.0489876 0.0197945 0.0087399 -0.0380793 -0.1514454 -0.0611888 0.1082945 -0.0361965 0.0844183 -0.027833 0.0281448 -0.057262 0.0410498 0.0396557 0.0351134 -0.0973674 -0.0041709 -0.071576 -0.1341855 -0.0137009 -0.0154215 -0.0324114 0.0638414 0.0388799 0.0173379 0.0174847 0.0255866 0.068328 -0.065002 0.0051417 0.0083945 -0.1696115 -0.0250292 -0.0696764 -0.005272 -0.0972307 -0.1740536 -0.0170914 -0.0008383 -0.0471862 0.0789068 0.0234909 0.0207266 -0.0393146 0.0310902 0.0762794 -0.048629 -0.000222 0.0155934 -0.1678026 0.0474587 -0.0414784 -0.0359844 -0.0410013 0.0531769 -0.011939 0.0242067 -0.0668303 -0.1655236 -0.1204249 0.1253947 -0.0375007 0.1013649 -0.0799596 0.050846 -0.0333231 0.0728696 0.0575744 -0.1986624 -0.0325101 0.079958 -0.0349662 0.0426065 0.0144978 0.11732 0.0198004 0.0402344 0.087511 0.0101583 -0.0062688 0.0037296 0.0156948 -0.0208042 -0.088966 -0.0332938 -0.1783325 0.090047 0.0170521 -0.055814 0.0080291 0.3057174 0.0133889 0.1058913 0.0023099 0.1624364 unknown
polarizability: 154.5119455|-0.0010155|124.8344319|-10.1169752|-2.2446594|134.6608556 unknown
InChI: InChI=1S/C6H12NPS.2Cl/c9-8-7-6-4-2-1-3-5-6;;/h6-7H,1-5H2;;
charge 0 multiplicity 1
23 atoms
Cl -3.676681 -1.497169 0.93707
Cl -2.943557 1.863976 0.988171
S  -2.378879 0.118113 -2.172414
P  -2.297326 -0.039276 -0.138348
N  -0.814065 -0.538425 0.534922
C  0.51573 -0.27233 -0.079154
C  1.026992 1.164548 0.196886
C  1.513144 -1.334013 0.442261
C  2.424857 1.374962 -0.43399
C  2.912796 -1.117855 -0.184801
C  3.435369 0.316516 0.067703
H  0.394792 -0.405892 -1.172757
H  1.08214 1.322131 1.293276
H  0.30687 1.903106 -0.203393
H  1.133039 -2.346347 0.212173
H  1.591171 -1.248112 1.547136
H  2.786409 2.394496 -0.202581
H  2.341621 1.309811 -1.538415
H  2.853649 -1.300296 -1.277157
H  3.618339 -1.864842 0.225664
H  4.41316 0.456543 -0.431017
H  3.60568 0.45912 1.154821
H  -0.83015 -0.807366 1.524944
