program: Gaussian 09
title: 000158700
version: EM64L-G09RevD.01
frameworkgroup: C1[X(C22H28N2O4)]
method: RPBEPBE
basis: SDD
operation: Freq
keyword: #p
keyword: freq=noraman
keyword: PBEPBE/SDD
title: #p freq=noraman PBEPBE/SDD
converged: YES YES NO NO
title: Mulliken charges:
elementType: O O O O N N C C C C C C C C C C C C C C C C C C C C C C H H H H H H H H H H H H H H H H H H H H H H H H H H H H
charge: -0.458569 -0.266065 -0.256727 -0.269459 -0.117726 -0.497400 -0.091255 -0.069369 -0.544406 -0.055927 -0.215767 -0.467741 -0.466447 -0.126127 -0.435842 0.153063 -0.373485 0.119461 -0.510522 0.164641 0.170545 0.236611 -0.416162 -0.552482 -0.379330 0.339069 -0.504678 -0.536562 0.239420 0.201236 0.247729 0.182918 0.190497 0.267069 0.212504 0.187456 0.243610 0.195542 0.218784 0.207759 0.223010 0.191048 0.212298 0.205692 0.226543 0.294940 0.360620 0.234888 0.242922 0.243386 0.236332 0.239448 0.247272 0.243725 0.216809 0.215202
chargesum: 0.00000
title: Mulliken charges with hydrogens summed into heavy atoms:
elementType: O O O O N N C C C C C C C C C C C C C C C C C C C C C C
charge: -0.097949 -0.266065 -0.256727 -0.269459 -0.117726 -0.202459 0.148165 0.131867 -0.113760 0.134570 0.051302 -0.067781 -0.027295 0.092657 -0.005073 0.153063 0.029861 0.119461 -0.078288 0.164641 0.170545 0.236611 -0.181274 -0.309560 -0.135944 0.339069 0.218374 0.139173
polarizability: 3.32781548e+02 2.31264763e+01 2.79767595e+02 1.52192601e+01 -3.09371349e+00 1.85283893e+02
1716.lowfreq: -7.9013 -0.0002 0.0004 0.0007 4.6141 6.9662 23.1646 33.8388 37.2766
frequency: 23.0353 33.8295 37.2703 48.8506 71.7626 84.5523 92.5587 100.8034 108.1291 124.5949 141.8710 158.1450 174.1565 191.0501 204.8161 214.8490 226.3695 240.3783 252.9865 265.1426 280.9894 293.2778 301.0851 309.9511 331.8065 337.7206 370.3778 386.1178 405.0381 429.1735 434.5181 438.3230 461.6412 478.1312 482.8389 489.7543 507.6332 528.4893 558.0830 564.0338 584.9907 587.5665 620.6896 621.6414 645.4913 686.4902 698.3044 721.1550 734.9938 745.7216 756.6994 776.6433 810.9251 814.7323 820.6814 824.6314 848.3519 881.2113 892.3842 895.7767 919.5552 932.8719 946.3414 952.0837 972.6056 985.6708 995.4860 1004.9186 1010.5308 1023.2768 1033.9818 1047.6693 1060.3650 1064.2510 1097.0468 1105.8902 1107.0624 1111.9454 1112.7975 1123.7948 1131.7630 1134.7616 1147.0094 1148.1252 1153.1362 1162.4900 1166.4616 1174.6095 1187.5039 1207.5407 1216.4609 1224.2811 1231.2430 1235.1594 1245.7896 1254.8411 1264.6848 1279.5690 1282.0004 1287.8853 1296.2455 1305.4240 1308.3816 1319.5787 1324.1051 1327.0843 1332.3107 1342.7375 1352.3968 1359.1455 1364.4381 1371.3403 1389.5282 1391.8134 1395.7883 1421.1312 1432.9757 1439.9880 1445.9417 1451.7421 1455.3495 1458.3667 1463.0943 1464.2493 1472.1862 1475.0274 1475.4818 1481.2045 1481.6765 1493.8665 1580.1208 1605.7665 1608.0574 1638.7177 2746.6310 2817.2561 2853.7404 2948.2353 2952.0060 2955.2138 2969.1049 2970.1447 2975.4230 2983.9649 2985.3290 2990.8465 3006.5886 3018.5271 3019.8015 3031.9184 3033.9368 3042.0595 3056.5133 3062.1617 3109.4479 3118.3705 3135.6133 3151.7846 3152.3793 3169.2046 3492.1836 3611.9151
redmass: 4.8024 4.5343 5.3087 5.4119 3.8435 4.3449 3.9112 1.1662 3.3337 3.6100 3.7208 4.1623 3.1392 2.8441 2.3792 3.5082 2.9319 1.8863 2.3672 4.8665 4.2616 2.8071 4.0621 3.7245 2.7185 3.4928 3.6609 4.9467 3.0950 3.0314 4.0602 4.1186 3.1696 2.9672 1.3418 3.9802 3.5291 2.7010 3.7468 1.0840 4.0587 5.0091 3.7336 3.4769 4.0553 4.3737 3.9523 5.1679 2.8503 3.4890 3.7326 4.1514 1.6761 2.9361 1.7921 2.3974 2.3016 2.7064 2.6083 2.2268 3.1101 3.2668 1.3335 2.5931 2.7080 3.2802 3.8863 2.4453 2.1236 3.1109 2.1667 1.9703 1.5953 2.4265 2.2222 2.3867 2.0043 1.2612 1.2918 2.2983 1.7646 2.3527 1.5213 1.5100 2.2584 1.8506 1.8803 2.2416 1.3495 1.3714 1.3998 1.4102 1.5413 1.5926 1.8934 1.3151 1.4336 1.3117 1.5472 1.5368 1.5981 1.4221 1.4940 1.3371 1.4203 1.5733 1.5549 1.5072 1.3717 1.6097 1.8477 1.6475 1.5536 1.6110 4.4773 1.1900 1.2222 2.5950 1.3218 1.0508 1.1009 1.0980 1.0509 1.0513 1.3077 1.1028 1.0967 1.1266 2.5338 3.2205 7.9801 7.5386 8.8847 7.0452 1.0773 1.0707 1.0708 1.0334 1.0816 1.0831 1.0810 1.0600 1.0660 1.0758 1.0674 1.0660 1.0294 1.0953 1.0921 1.1035 1.0898 1.0996 1.0975 1.0998 1.1046 1.0985 1.0888 1.1052 1.0910 1.0955 1.0648 1.0798
irintensity: 0.8670 0.2627 0.3297 2.6289 2.3837 0.2213 1.3948 0.0195 2.2283 2.1164 0.7877 3.3398 0.3093 5.3788 1.5656 1.0194 2.3096 1.2844 1.9152 6.3447 0.1812 3.6413 14.5115 1.7787 1.7749 5.2939 5.2183 3.3937 6.5713 6.5863 1.3054 2.7940 1.4457 11.2539 62.2920 28.1186 4.7321 0.4435 0.6025 194.6524 3.8831 3.6124 5.2886 5.2072 3.1982 11.9721 8.5776 5.5266 4.9790 5.4555 0.0254 2.4446 9.6068 3.3167 72.1984 6.9731 8.8439 0.1862 6.6496 5.5633 4.5702 3.9714 0.0367 9.1377 21.7504 36.9885 47.1427 17.3348 0.1395 53.5209 1.9911 17.0288 2.4648 15.8027 23.8836 0.6949 41.9740 0.2239 1.2704 26.4426 19.4943 17.1048 71.5791 29.0675 122.1059 105.7516 48.0955 41.3687 5.9382 4.8823 5.4233 10.0553 13.9500 27.5810 15.4260 58.7650 52.6132 13.4450 31.5109 18.0534 1.8995 12.6516 28.3486 4.9649 20.4355 17.7921 50.9672 38.3578 4.9015 13.2395 13.9221 28.0633 11.9260 15.6760 22.7699 19.6908 11.9924 1.1448 3.6053 14.1021 8.5973 3.2796 12.4423 10.7340 84.5462 2.3784 17.1571 7.5917 16.0013 41.5076 15.8297 6.9052 152.2451 92.6683 67.6198 88.2117 139.9826 72.1515 8.8637 54.9763 16.0714 39.6955 42.3785 55.0199 23.4227 32.1292 30.5726 21.7451 32.5302 55.5363 62.5817 58.7468 5.6413 58.7257 26.5239 30.7221 10.4466 13.1032 9.6001 12.0167 32.6535 33.5419
temp: 298.150 k
press: 1.00000 atm
elementType: 8 8 8 8 7 7 6 6 6 6 6 6 6 6 6 6 6 6 6 6 6 6 6 6 6 6 6 6 1 1 1 1 1 1 1 1 1 1 1 1 1 1 1 1 1 1 1 1 1 1 1 1 1 1 1 1
symmnumber: 1
zpe: 1224869.8 jmol-1
zpe.correction: 0.466528 hartree
zpe.thermalcorrener: 0.492052 hartree
zpe.thermalcorrenthalpy: 0.492996 hartree
zpe.thermalcorrgfe: 0.411170 hartree
zpe.sumelectzpe: -1263.441033 hartree
zpe.sumelectthermal: -1263.415509 hartree
zpe.sumelectthermalent: -1263.414565 hartree
zpe.sumelectthermalfe: -1263.496391 hartree
dipole: -0.6932 1.7636 -4.2321
dipole: 4.6370
quadrupole: -191.3346 -139.9741 -170.8668
quadrupole: 11.5593 13.5025 -8.9193
quadrupole: -23.9428 27.4177 -3.4750 11.5593 13.5025 -8.9193
hfenergy: -1263.9075609 hartree
pointgroup: C01 [X(C22H28N2O4)]
dipole: -0.2768941 -0.6520236 1.6811955 debye
polarizability: 332.2091322|-24.0587317|280.0929872|-14.9950826|-5.0788064|185.5309174 unknown
InChI: InChI=1S/C22H28N2O4/c1-27-13-4-5-14-15-7-8-24-11-12-3-6-19(25)20(22(26)28-2)16(12)10-18(24)21(15)23-17(14)9-13/h4-5,9,12,16,18-20,23,25H,3,6-8,10-11H2,1-2H3
charge 0 multiplicity 1
56 atoms
O  -5.116736 -1.199161 -2.106758
O  -3.44695 -2.368163 1.637071
O  -3.640393 -3.059622 -0.56748
O  6.399403 -1.860983 -0.627827
N  -0.71177 2.316059 0.502347
N  1.679484 -0.609544 0.543487
C  -2.815935 0.277259 0.653781
C  -3.146981 1.766458 0.343325
C  -1.359734 -0.065841 0.249868
C  -0.367677 0.923972 0.913263
C  -3.881615 -0.650754 -0.011632
C  -2.067812 2.678396 0.973314
C  -3.316156 2.022689 -1.174973
C  -4.022399 -0.402231 -1.539554
C  -4.356456 1.07177 -1.808426
C  1.070348 0.661649 0.547719
C  0.326148 3.311501 0.880011
C  2.003704 1.619446 0.168968
C  1.636467 3.079176 0.090891
C  -3.643662 -2.127689 0.279182
C  3.250125 0.926262 -0.09453
C  3.016811 -0.472993 0.149752
C  4.547271 1.332695 -0.508709
C  4.017816 -1.460127 -0.005689
C  5.555184 0.369635 -0.669423
C  5.291783 -1.012396 -0.421663
C  -3.279719 -3.791913 2.02668
C  6.198909 -3.290358 -0.403822
H  -2.892416 0.131097 1.750804
H  -4.113191 2.00477 0.839504
H  -1.211307 -0.02188 -0.843323
H  -1.126109 -1.098612 0.580085
H  -0.492158 0.816908 2.030239
H  -4.864098 -0.403449 0.446092
H  -2.262355 3.730052 0.689785
H  -2.141865 2.615283 2.09238
H  -2.334712 1.917241 -1.673891
H  -3.633946 3.072032 -1.331825
H  -3.065875 -0.670774 -2.037951
H  -5.366734 1.272197 -1.398028
H  -4.417327 1.226257 -2.900976
H  0.546855 3.273234 1.977933
H  -0.075877 4.317049 0.65747
H  2.436546 3.71864 0.513886
H  1.491476 3.39223 -0.962196
H  1.213229 -1.487602 0.758609
H  -4.850273 -2.15451 -2.0222
H  4.765455 2.38812 -0.705751
H  3.808879 -2.516821 0.185873
H  6.564514 0.646376 -0.988371
H  -3.121069 -3.767004 3.113614
H  -2.41526 -4.233886 1.503677
H  -4.187068 -4.363041 1.768956
H  7.171249 -3.757605 -0.619989
H  5.428378 -3.702878 -1.08579
H  5.9112 -3.499516 0.646213
