program: Gaussian 09
title: 000158628
version: EM64L-G09RevD.01
frameworkgroup: C1[X(C12H5Br5)]
method: RPBEPBE
basis: SDD
operation: Freq
keyword: #pfreq=noraman
keyword: PBEPBE/SDD
title: #p freq=noraman PBEPBE/SDD
converged: YES YES NO NO
title: Mulliken charges:
elementType: Br Br Br Br Br C C C C C C C C C C C C H H H H H
charge: 0.073775 0.071666 0.064687 0.119766 0.074132 0.397172 0.365971 -0.349320 -0.343896 -0.327331 -0.385454 -0.166180 -0.163996 -0.176126 -0.183863 -0.192574 -0.197534 0.269761 0.271057 0.267249 0.251254 0.259785
chargesum: 0.00000
title: Mulliken charges with hydrogens summed into heavy atoms:
elementType: Br Br Br Br Br C C C C C C C C C C C C
charge: 0.073775 0.071666 0.064687 0.119766 0.074132 0.397172 0.365971 -0.079559 -0.072839 -0.060082 -0.134200 -0.166180 -0.163996 -0.176126 0.075922 -0.192574 -0.197534
polarizability: 3.77498497e+02 -2.05465941e-01 2.33142145e+02 -3.79216056e+00 9.41110484e+00 8.75770265e+01
1716.lowfreq: -4.4648 -2.0797 -1.7817 -0.0002 -0.0001 0.0002 18.7096 29.1816 38.6325
frequency: 18.7064 29.1793 38.6322 51.7173 104.2550 105.5987 125.3816 132.9791 151.9248 160.0076 163.5217 189.2992 213.4312 248.3654 279.3202 330.5656 362.3228 363.4811 419.0913 436.7368 481.1683 493.5879 507.4048 560.3941 617.8926 647.7263 690.0388 696.1723 702.9198 714.2892 815.6428 826.8092 877.0913 889.7099 899.3771 959.1280 980.2296 992.4001 1052.2662 1106.0789 1133.2747 1152.3721 1196.2592 1255.5811 1285.0300 1319.0295 1343.6259 1374.1338 1380.4044 1405.3709 1461.6570 1519.1010 1552.1019 1577.6117 1589.3871 3148.1903 3159.8870 3168.3830 3171.2701 3174.6031
redmass: 27.8030 18.2041 24.1120 19.4589 11.9243 11.2649 49.8325 52.0821 25.0462 11.4926 9.6240 4.7473 64.6547 8.9017 9.4579 7.2732 8.3002 9.9453 7.0284 3.1930 6.2505 6.3469 5.3310 5.4237 5.6243 7.4681 8.6666 4.0438 3.8833 6.1188 8.7604 1.3629 1.4550 1.3633 1.6331 1.3612 8.0250 5.6098 4.8601 2.2432 2.2545 1.4757 1.9699 1.4131 2.3014 2.5123 8.7091 5.3229 2.7807 2.8799 3.2616 7.5280 8.3114 6.4054 6.1623 1.0890 1.0921 1.0914 1.0929 1.0961
irintensity: 0.0586 0.1081 0.1361 0.1034 0.1157 0.1295 0.3613 0.1207 0.0640 0.1661 0.0989 0.0213 0.0062 4.1508 3.6806 0.8263 8.5380 14.2060 1.1505 11.2755 0.5756 0.3206 0.1717 4.0839 0.6856 10.5768 12.2590 11.4841 10.9217 74.4933 20.3359 39.2317 33.9782 0.9817 1.5363 0.9335 36.1240 18.9174 27.1432 59.2517 29.0248 2.0678 31.0072 2.6166 11.4115 39.9673 0.6584 19.8116 14.2546 163.8434 43.8149 127.7279 7.9391 19.8674 6.6141 5.2541 3.1526 0.0754 1.6880 2.7742
temp: 298.150 k
press: 1.00000 atm
elementType: 35 35 35 35 35 6 6 6 6 6 6 6 6 6 6 6 6 1 1 1 1 1
symmnumber: 1
zpe: 333770.8 jmol-1
zpe.correction: 0.127127 hartree
zpe.thermalcorrener: 0.144068 hartree
zpe.thermalcorrenthalpy: 0.145013 hartree
zpe.thermalcorrgfe: 0.076486 hartree
zpe.sumelectzpe: -526.389355 hartree
zpe.sumelectthermal: -526.372413 hartree
zpe.sumelectthermalent: -526.371469 hartree
zpe.sumelectthermalfe: -526.439995 hartree
dipole: 0.3737 -1.2291 -0.5632
dipole: 1.4027
quadrupole: -155.8742 -136.3182 -147.4114
quadrupole: -2.7955 -1.6220 2.8533
quadrupole: -9.3396 10.2164 -0.8769 -2.7955 -1.6220 2.8533
hfenergy: -526.5164817 hartree
pointgroup: C01 [X(C12H5Br5)]
dipole: -0.1714885 -0.4874251 0.1937579 debye
dipolederiv: -0.1017069 -0.1795789 -0.0379384 -0.2954033 -0.5446742 -0.1155139 -0.0605053 -0.1125872 -0.0116888 -0.1811596 0.2454499 0.0566729 0.3471714 -0.4846291 -0.1158684 0.0844428 -0.1162849 -0.0173755 -0.2113867 0.2241965 -0.0906796 0.3606639 -0.3863612 0.1597709 -0.1419897 0.1569737 -0.0561687 -0.7166226 -0.0475187 0.0109327 -0.0622397 0.0746225 0.0072801 0.0162438 0.0102656 0.051599 -0.800361 -0.115898 0.0395548 -0.1374098 -0.003465 0.0056646 0.0523654 0.0041336 0.0114215 0.47806 -0.0003309 -0.0042448 0.0472639 0.1532374 0.061997 -0.0124738 0.0320534 0.0309618 0.3151006 0.0372167 -0.008499 -0.026446 0.0054644 -0.048256 0.0136992 -0.0154539 0.016595 -0.3801096 0.1823766 0.0454047 0.141469 -0.2602561 -0.0252294 0.0931323 -0.0309466 -0.0985079 -0.326648 -0.1621398 -0.0435922 -0.1628886 -0.3083467 -0.0264993 -0.0790871 -0.0332952 -0.0920529 -0.2747648 0.180997 -0.0762849 0.092402 -0.19972 0.0328929 -0.1056689 0.0395572 -0.0910588 -0.1354118 -0.0379994 0.0261451 0.062385 -0.0178869 -0.0623806 0.0473391 -0.0568295 -0.1124516 0.0118248 0.407873 0.0893826 0.4636765 0.9948032 0.2232111 0.1372112 0.216954 -0.0314019 0.159965 -0.5483267 -0.1245122 -0.5783105 0.873932 0.2175725 -0.1754133 0.2271451 -0.0215666 0.0672799 -0.6315186 0.2522709 -0.6400096 0.6936363 -0.3126267 0.2850709 -0.3082511 0.0421076 -0.3359869 -0.0561056 0.0166299 0.0765719 0.0329067 -0.0408796 -0.0642467 -0.0467424 -0.0528332 0.9617545 0.1096723 -0.011167 0.1121321 -0.534998 -0.1105014 -0.0159561 -0.1089736 -0.1012429 1.1825312 0.4131411 -0.1551299 0.2264397 -0.1916018 0.0436031 -0.0852002 0.0410741 -0.1215649 0.082699 -0.0713299 -0.010257 -0.0751372 0.0192863 -0.0317595 -0.0282789 -0.0223853 0.1372019 0.0595871 0.0682126 0.0213278 0.0821984 0.0345358 -0.0284165 0.0336633 -0.0230943 0.1364396 0.0786469 -0.0677215 0.0269327 -0.0738447 0.0251557 0.049052 0.0417801 0.0391731 0.1236834 0.0291611 0.0852187 -0.0374573 0.0908902 0.0212881 0.0558733 -0.053099 0.0458937 0.1247662 0.0375478 -0.0358862 0.0145082 -0.0515749 0.0030706 0.0610139 0.0169708 0.0616206 0.1331377 unknown
polarizability: 377.3010021|-5.9645651|233.9752329|0.0465332|-1.6835086|86.9414329 unknown
InChI: InChI=1S/C12H5Br5/c13-8-2-1-6(3-9(8)14)7-4-10(15)12(17)11(16)5-7/h1-5H
charge 0 multiplicity 1
22 atoms
Br 3.340436 3.003001 0.579643
Br 3.766176 -2.759871 -0.634456
Br -4.209963 2.277255 -0.907434
Br 5.332881 0.261771 -0.065377
Br -5.723172 -0.672299 0.215764
C  0.539043 -0.116303 0.045051
C  -0.944794 -0.237753 0.081048
C  1.352483 -1.247988 -0.217094
C  1.176029 1.12995 0.273249
C  -1.767673 0.841377 -0.334648
C  -1.575586 -1.429169 0.529032
C  2.579311 1.238124 0.238533
C  2.755457 -1.134903 -0.247644
C  -3.1740 0.738623 -0.303416
C  -2.978334 -1.535895 0.559916
C  3.402033 0.10943 -0.021281
C  -3.789192 -0.454417 0.144362
H  0.895486 -2.217092 -0.433257
H  0.583302 2.016631 0.513489
H  -1.316231 1.760431 -0.719657
H  -0.974054 -2.269808 0.889217
H  -3.452537 -2.454198 0.917158
