program: Gaussian 09
title: 000158624
version: EM64L-G09RevD.01
frameworkgroup: C1[X(C21H30N2O2)]
method: RPBEPBE
basis: SDD
operation: Freq
keyword: #p
keyword: freq=noraman
keyword: PBEPBE/SDD
title: #p freq=noraman PBEPBE/SDD
converged: YES YES NO NO
title: Mulliken charges:
elementType: O O N N C C C C C C C C C C C C C C C C C C C C C H H H H H H H H H H H H H H H H H H H H H H H H H H H H H H
charge: -0.271772 -0.241028 -0.184650 -0.052087 -0.169164 -0.487582 -0.362706 0.163714 -0.463355 0.327819 -0.014795 -0.376572 -0.373398 -0.406051 -0.380778 -0.519933 0.282886 -0.372809 -0.362443 -0.351016 -0.354001 -0.257906 -0.355734 -0.228036 -0.697487 0.296058 0.249439 0.243046 0.227747 0.236362 0.228921 0.228817 0.251029 0.182492 0.183135 0.193060 0.225912 0.208435 0.207290 0.188947 0.229005 0.227671 0.188847 0.185265 0.223135 0.186489 0.187689 0.254414 0.194899 0.193563 0.226514 0.228624 0.208526 0.214016 0.209536
chargesum: 0.00000
title: Mulliken charges with hydrogens summed into heavy atoms:
elementType: O O N N C C C C C C C C C C C C C C C C C C C C C
charge: -0.271772 -0.241028 -0.184650 -0.052087 0.126893 0.004903 0.101402 0.163714 -0.005617 0.327819 -0.014795 0.056948 0.002797 0.028297 0.015459 -0.063258 0.282886 0.001303 -0.139308 0.023162 -0.099586 -0.031391 0.032728 0.000589 -0.065409
polarizability: 2.98394427e+02 3.22268629e+01 2.70096482e+02 1.97712069e+01 -1.80973611e+01 1.77221084e+02
1716.lowfreq: -23.2897 -5.1887 -1.8098 -0.0007 -0.0005 -0.0003 7.1159 11.0034 14.7916
frequency: -20.2652 10.6864 14.4040 27.1450 33.2460 39.1422 49.5072 59.7678 70.6098 86.9180 101.7812 121.8585 134.3534 138.6396 145.3810 151.3481 183.7364 207.2684 218.5347 224.1414 228.5811 236.6291 267.2880 277.3532 307.5905 339.9560 388.9277 398.9325 414.0788 442.3632 447.7620 464.4808 487.6705 544.7236 554.6384 574.3284 601.7111 656.2871 668.9860 685.1834 718.1429 720.7497 724.7749 730.3463 739.1120 751.8584 771.8557 780.8483 785.0210 823.2787 845.0657 854.6111 862.7066 873.0958 884.2306 886.2425 908.7970 937.2611 943.0873 949.1911 974.8205 983.2119 996.3817 1007.2200 1015.5841 1031.5779 1033.4687 1039.5114 1046.9717 1063.4550 1069.6694 1079.0880 1079.9278 1084.6751 1095.2790 1102.9545 1117.4848 1132.9954 1166.4995 1170.9246 1182.7005 1185.1944 1200.7368 1204.3053 1207.3116 1220.3298 1220.6780 1227.3294 1233.3347 1255.0087 1263.7862 1265.6601 1278.1951 1278.9091 1283.6445 1288.0867 1290.3763 1295.7095 1309.8988 1311.7800 1319.5572 1325.4673 1328.4782 1333.5963 1348.8872 1353.0640 1365.2535 1378.0663 1387.0054 1424.1702 1445.4179 1452.8762 1455.7402 1459.8947 1460.5117 1463.8231 1465.3816 1470.8932 1471.8727 1476.1797 1478.9864 1485.4074 1488.4164 1490.0034 1506.0733 1577.7780 1596.5800 1631.0999 1646.4467 2891.9535 2947.2831 2949.3419 2951.1442 2951.4521 2957.8561 2958.7060 2962.4516 2966.7492 2970.2975 2980.1906 2982.0867 2988.6131 2999.8533 3012.2009 3015.3398 3018.9045 3024.4324 3034.9297 3036.5082 3049.4445 3066.6938 3068.6676 3081.5476 3088.7466 3107.5969 3108.1410 3131.5085 3150.4304 3165.2444
redmass: 1.7790 3.4323 4.3371 5.8801 3.9180 3.8318 4.3085 4.5493 3.4349 1.6472 3.0153 3.1399 1.9598 2.2145 3.0343 2.6987 3.3333 3.5048 4.9863 3.5636 1.1203 3.8093 3.7203 3.1933 3.6954 4.4456 3.9396 3.5791 3.3095 3.3709 3.0404 3.4554 3.1314 3.7475 5.8355 4.5779 6.8241 4.8197 4.1907 3.2485 1.0621 4.1259 1.1482 2.0659 1.6374 1.8328 1.6808 3.4513 1.4135 2.8219 2.3670 2.0702 3.4249 1.3914 1.7034 1.8856 2.1649 1.6889 1.4040 2.2778 2.9508 1.3215 4.2279 1.2425 1.7171 2.1428 2.7016 2.2439 2.6755 2.3917 2.2743 2.1340 2.2928 2.8409 1.9544 2.4720 1.9765 2.6085 1.1191 1.2139 1.9212 1.7637 1.8913 1.8823 1.4093 1.2920 1.4005 1.7607 1.3621 1.3128 1.4016 1.3200 1.0786 1.6922 1.2028 1.7152 1.1138 1.1995 1.1920 1.3324 1.4483 1.7137 1.5283 1.4476 1.5800 1.6538 1.5281 5.4110 1.2171 2.4907 2.4611 1.1049 1.1033 1.0775 1.0707 1.0709 1.0762 2.2606 1.1016 1.0429 1.0818 1.0864 1.0964 1.1388 1.2589 6.3754 5.8328 7.6734 10.1249 1.0681 1.0586 1.0587 1.0591 1.0898 1.0602 1.0649 1.0610 1.0587 1.0367 1.0633 1.0933 1.0961 1.1005 1.0882 1.0748 1.0915 1.1023 1.0723 1.1042 1.1038 1.1007 1.0992 1.0870 1.1027 1.0887 1.1018 1.0874 1.0933 1.1001
irintensity: 0.0545 0.5985 0.2433 0.2510 0.7674 0.4262 0.6176 0.9649 0.9801 0.0930 0.4538 0.7478 0.2466 0.0344 6.6098 0.2997 2.8924 1.1137 3.3786 7.9467 0.0759 2.1557 2.5364 0.1038 0.6849 3.9726 0.7951 4.9159 6.2992 0.4658 3.1549 8.7813 3.1704 1.0216 0.2106 4.7884 1.3405 0.5270 4.4173 4.7798 12.8308 2.7989 1.2231 25.8766 2.0373 5.5450 66.5553 4.5285 0.7860 7.6784 3.1423 3.1554 6.3893 2.0274 1.7283 5.5900 35.4502 6.7055 2.0873 39.8295 66.4527 0.5379 0.1103 3.3791 4.1380 7.3342 54.2346 21.7535 3.1579 26.3526 10.5459 4.4405 0.7282 28.5133 73.8472 10.9455 8.1541 131.5346 3.8399 7.4173 22.0205 4.6579 22.3155 53.1840 19.2231 12.1856 3.0086 3.6067 25.7412 3.6641 2.9717 1.2143 3.2685 19.8774 1.8105 72.2971 8.4240 0.3736 0.1939 31.8200 5.3134 6.1987 8.3544 14.0900 1.6444 0.1250 0.4267 2.5220 11.5658 36.4505 16.5594 14.6179 10.8306 1.3791 0.1981 3.8416 0.4544 49.5349 0.5483 12.1967 1.6301 2.0312 35.1364 0.5096 31.1556 22.0288 234.7324 98.2753 200.9789 70.6993 4.6110 8.9905 2.5970 39.9406 17.3877 87.1786 25.2461 154.2333 34.1162 52.5479 11.9184 7.2824 0.4544 6.3106 15.2232 16.4831 3.0316 41.5237 88.9739 100.8782 97.8857 61.2486 13.4252 20.6052 14.7956 19.0202 8.4178 25.8769 25.9743
temp: 298.150 k
press: 1.00000 atm
elementType: 8 8 7 7 6 6 6 6 6 6 6 6 6 6 6 6 6 6 6 6 6 6 6 6 6 1 1 1 1 1 1 1 1 1 1 1 1 1 1 1 1 1 1 1 1 1 1 1 1 1 1 1 1 1 1
symmnumber: 1
zpe: 1235121.2 jmol-1
zpe.correction: 0.470433 hartree
zpe.thermalcorrener: 0.495447 hartree
zpe.thermalcorrenthalpy: 0.496391 hartree
zpe.thermalcorrgfe: 0.411070 hartree
zpe.sumelectzpe: -1076.294487 hartree
zpe.sumelectthermal: -1076.269472 hartree
zpe.sumelectthermalent: -1076.268528 hartree
zpe.sumelectthermalfe: -1076.353849 hartree
dipole: -2.5987 2.2590 -3.4600
dipole: 4.8814
quadrupole: -132.0115 -144.5352 -154.8994
quadrupole: -9.5136 9.5324 2.7689
quadrupole: 11.8039 -0.7198 -11.0841 -9.5136 9.5324 2.7689
hfenergy: -1076.7649193 hartree
pointgroup: C01 [X(C21H30N2O2)]
dipole: 0.9029591 0.8274643 1.4792846 debye
polarizability: 301.2181624|-32.6174147|261.5944813|20.3399061|25.8958195|182.8993499 unknown
InChI: InChI=1S/C21H30N2O2/c1-2-3-4-5-6-7-8-13-20(24)25-19-14-15-23-16-17-11-9-10-12-18(17)22-21(19)23/h9-12,19H,2-8,13-16H2,1H3
charge 0 multiplicity 1
55 atoms
O  2.901753 -1.429781 0.400984
O  2.919414 -2.765849 -1.522319
N  2.847378 1.765405 0.744797
N  1.063795 0.875189 -0.633525
C  3.306674 -0.237041 -0.412893
C  4.63433 0.33684 0.126693
C  4.212434 1.408966 1.170912
C  2.282149 0.849933 -0.130536
C  2.06519 2.82554 1.397153
C  0.686868 2.944124 0.74052
C  0.249303 1.97117 -0.211862
C  -0.343305 -2.712026 0.46676
C  -1.806168 -2.968133 0.04114
C  0.572013 -3.930919 0.214726
C  -2.734777 -1.766827 0.329007
C  2.060227 -3.680267 0.601249
C  2.671382 -2.629425 -0.304077
C  -4.178442 -1.972954 -0.181194
C  -0.171408 4.00463 1.098054
C  -5.111353 -0.778304 0.120312
C  -1.047113 2.091841 -0.7757
C  -1.462527 4.116729 0.532125
C  -6.546605 -0.972142 -0.420162
C  -1.898968 3.152913 -0.407884
C  -7.476158 0.221273 -0.110635
H  3.331057 -0.540098 -1.471531
H  5.264145 -0.454037 0.562445
H  5.191105 0.808945 -0.701325
H  4.87272 2.296577 1.154838
H  4.206392 1.003006 2.20413
H  1.960535 2.601829 2.484743
H  2.613921 3.788663 1.325657
H  0.040288 -1.826528 -0.078375
H  -0.312875 -2.447832 1.544695
H  -2.197104 -3.868885 0.560683
H  -1.832629 -3.198363 -1.044685
H  0.528969 -4.220963 -0.853348
H  0.20728 -4.798491 0.799743
H  -2.305717 -0.855656 -0.137064
H  -2.754946 -1.571909 1.421856
H  2.633582 -4.616645 0.471951
H  2.134478 -3.354881 1.652425
H  -4.155605 -2.151662 -1.27695
H  -4.603511 -2.892763 0.27362
H  0.167598 4.752298 1.827401
H  -4.676065 0.145871 -0.315701
H  -5.152635 -0.611406 1.217221
H  -1.352919 1.337411 -1.507884
H  -6.502648 -1.134303 -1.516679
H  -6.975737 -1.899025 0.012964
H  -2.118205 4.945118 0.821229
H  -2.897429 3.231352 -0.852208
H  -7.084747 1.154197 -0.559005
H  -8.495268 0.057231 -0.507183
H  -7.559815 0.384967 0.980591
