program: Gaussian 09
title: 000158594
version: EM64L-G09RevD.01
frameworkgroup: C1[X(C15H12O3)]
method: RPBEPBE
basis: SDD
operation: Freq
keyword: #pfreq=noraman
keyword: PBEPBE/SDD
title: #p freq=noraman PBEPBE/SDD
converged: YES YES NO NO
title: Mulliken charges:
elementType: O O O C C C C C C C C C C C C C C C H H H H H H H H H H H H
charge: -0.266308 -0.435549 -0.434899 0.071567 -0.004251 0.434706 -0.586532 -0.610792 0.467959 0.339790 0.215176 -0.479109 -0.595060 -0.672965 -0.628283 -0.547779 0.315181 0.346294 0.229413 0.231473 0.224244 0.229265 0.233547 0.222090 0.261419 0.228505 0.228087 0.274841 0.354273 0.353696
chargesum: 0.00000
title: Mulliken charges with hydrogens summed into heavy atoms:
elementType: O O O C C C C C C C C C C C C C C C
charge: -0.266308 -0.081276 -0.081203 0.071567 -0.004251 0.434706 -0.125645 -0.157283 0.467959 0.339790 0.215176 -0.023471 -0.333642 -0.444460 -0.400196 -0.272938 0.315181 0.346294
polarizability: 2.76161137e+02 -9.32117911e+00 1.80844508e+02 7.55968663e-01 -8.26503270e-01 8.08880560e+01
1716.lowfreq: -13.8472 -9.7484 -6.5565 0.0005 0.0006 0.0008 48.6165 126.9126 129.9844
frequency: 48.6136 126.9092 129.9836 177.7402 211.1846 225.7466 250.6600 256.2147 270.6084 312.9834 325.5335 341.4576 342.2889 408.7920 415.6901 434.9232 454.6636 492.4985 501.4512 514.4014 528.8980 562.1221 572.9495 585.7666 615.0369 644.9194 675.2568 684.9822 739.3971 762.0954 822.3515 831.3442 845.6546 863.2636 884.6510 895.2412 911.1192 951.4079 992.0565 995.8136 1001.2309 1021.2828 1045.0921 1052.0022 1113.6608 1129.0459 1160.8077 1173.3200 1174.7094 1191.2631 1208.6115 1229.6618 1239.9822 1280.7991 1295.4338 1308.6757 1339.8018 1342.6632 1361.5016 1389.9916 1393.7366 1441.2234 1450.5981 1457.9674 1458.8080 1469.3976 1474.8721 1511.7893 1585.2304 1607.7705 1622.6128 1628.8986 2944.8199 2959.8400 2967.8670 3043.1033 3045.0915 3084.6554 3107.8447 3111.1786 3153.2527 3189.7457 3583.7762 3584.8895
redmass: 6.7050 3.4357 5.0769 3.3751 5.5903 3.0864 5.3894 3.6129 2.3631 4.9032 8.8201 1.1230 1.1274 5.4566 4.5207 4.1125 4.3663 4.2467 5.0756 4.9415 5.0199 3.9381 5.6490 4.0840 3.4032 2.7833 5.8497 4.1794 3.7454 4.9651 1.4990 1.4931 2.0491 1.5703 1.5398 5.6115 4.1743 4.0952 5.0821 2.6024 3.6839 2.2496 2.8590 3.2577 1.6525 1.5225 1.1778 1.3631 1.2755 1.3306 1.2976 1.4329 1.3899 2.5777 2.8353 1.3834 4.2171 1.6309 2.2856 4.4795 4.6770 3.6416 1.1896 1.1243 1.4117 2.2033 3.1294 4.4495 7.3398 7.9595 7.2569 7.2545 1.0692 1.0685 1.0626 1.0923 1.0987 1.0941 1.0914 1.0913 1.0921 1.0930 1.0660 1.0660
irintensity: 0.2300 3.7155 4.4368 7.0718 5.8028 0.3821 0.6306 1.9002 3.5906 0.2674 0.0814 6.9953 275.0265 2.6876 1.8155 19.0221 10.2054 2.0438 5.3111 9.7752 14.5787 1.1228 4.9011 9.7226 6.2737 4.4997 0.6195 7.3309 13.7875 0.9069 22.7760 23.3659 8.6117 36.4593 33.5192 0.9677 6.6331 79.7502 24.8757 29.3256 20.2033 20.9483 20.7839 47.4388 149.6952 276.8268 30.3662 4.0385 46.2067 14.6107 3.5580 20.2889 16.1128 17.7509 55.8533 2.0132 1.9127 13.3075 35.7336 96.5013 33.3411 62.3216 7.7174 8.0744 13.1011 44.1375 25.8926 2.4931 80.0222 7.7837 30.2058 229.3703 67.9418 22.5645 33.4943 43.9001 23.1105 18.3899 25.2130 19.3040 7.0359 0.7144 72.6431 37.9981
temp: 298.150 k
press: 1.00000 atm
elementType: 8 8 8 6 6 6 6 6 6 6 6 6 6 6 6 6 6 6 1 1 1 1 1 1 1 1 1 1 1 1
symmnumber: 1
zpe: 607375.0 jmol-1
zpe.correction: 0.231337 hartree
zpe.thermalcorrener: 0.245214 hartree
zpe.thermalcorrenthalpy: 0.246158 hartree
zpe.thermalcorrgfe: 0.191804 hartree
zpe.sumelectzpe: -803.222865 hartree
zpe.sumelectthermal: -803.208988 hartree
zpe.sumelectthermalent: -803.208044 hartree
zpe.sumelectthermalfe: -803.262398 hartree
dipole: 1.0588 1.3705 1.2184
dipole: 2.1175
quadrupole: -96.3421 -92.1259 -107.8320
quadrupole: -22.0007 -0.5470 -2.6274
quadrupole: 2.4245 6.6407 -9.0653 -22.0007 -0.5470 -2.6274
hfenergy: -803.4542017 hartree
pointgroup: C01 [X(C15H12O3)]
dipole: 0.4243326 0.5328216 0.479641 debye
polarizability: 275.8275763|-10.8694703|181.1723536|1.1467567|-0.966622|80.8937713 unknown
InChI: InChI=1S/C15H12O3/c16-11-3-8-1-2-9-4-12(17)6-13-15(9)14(8)10(5-11)7-18-13/h3-6,16-17H,1-2,7H2
charge 0 multiplicity 1
30 atoms
O  -0.740103 -2.407398 -0.260611
O  4.962932 -0.031405 -0.147622
O  -4.933837 -0.062758 -0.216161
C  0.747586 0.015251 0.069865
C  -0.719999 0.026114 0.089249
C  1.481365 1.222053 -0.115365
C  0.696286 2.513497 -0.310788
C  -0.639676 2.509359 0.476534
C  -1.444116 1.241159 0.215557
C  1.426828 -1.225228 0.168229
C  -1.432242 -1.189433 -0.106593
C  0.581085 -2.459402 0.421988
C  2.887193 1.173593 -0.172469
C  -2.851113 1.232988 0.119653
C  2.833101 -1.275825 0.082955
C  -2.833506 -1.213208 -0.216734
C  3.557329 -0.068693 -0.075042
C  -3.532644 0.007844 -0.104682
H  1.307962 3.386664 -0.018815
H  0.472636 2.627069 -1.392633
H  -1.232948 3.40601 0.2200
H  -0.413818 2.571824 1.561725
H  1.054089 -3.377969 0.040006
H  0.388141 -2.579987 1.510129
H  3.483082 2.08209 -0.306291
H  -3.413153 2.171528 0.214098
H  3.360338 -2.237241 0.149747
H  -3.371266 -2.149506 -0.379854
H  5.343946 -0.941512 -0.077285
H  -5.33768 0.834221 -0.11239
