program: Gaussian 09
title: 000002701
version: EM64L-G09RevD.01
frameworkgroup: C1[X(C21H18NO4)]
method: RPBEPBE
basis: SDD
operation: Freq
keyword: #p
keyword: freq=noraman
keyword: PBEPBE/SDD
title: #p freq=noraman PBEPBE/SDD
converged: YES YES NO NO
title: Mulliken charges:
elementType: O O O O N C C C C C C C C C C C C C C C C C C C C C H H H H H H H H H H H H H H H H H H
charge: -0.256929 -0.237184 -0.298360 -0.275039 -0.771208 0.155843 0.295242 0.366025 0.243035 0.333094 0.218081 0.466344 -0.758354 -0.437265 -0.456020 -0.525365 -0.578086 0.096447 0.031701 -0.385766 0.181287 0.216337 -0.359550 -0.200573 -0.491240 -0.530166 0.276725 0.237747 0.168212 0.262238 0.284457 0.233491 0.418074 0.421127 0.417081 0.257899 0.261704 0.261569 0.230302 0.265179 0.232335 0.233596 0.236687 0.259246
chargesum: 1.00000
title: Mulliken charges with hydrogens summed into heavy atoms:
elementType: O O O O N C C C C C C C C C C C C C C C C C C C C C
charge: -0.256929 -0.237184 -0.298360 -0.275039 0.485075 0.155843 0.295242 0.366025 0.243035 0.333094 0.218081 0.466344 -0.481629 -0.199518 -0.287808 -0.263127 -0.293629 0.096447 0.031701 -0.152275 0.181287 0.216337 -0.101651 0.322700 0.236575 0.199365
polarizability: 5.51083816e+02 1.08822801e+01 2.60027703e+02 -9.91195456e-03 -1.89500813e+00 1.08961736e+02
1716.lowfreq: -59.8001 -4.3611 -1.7344 -0.0004 0.0002 0.0006 5.2142 30.4992 40.1221
frequency: -59.7990 30.4830 40.1102 54.5024 68.5334 74.0646 104.0501 115.8334 137.1284 145.5137 174.8606 186.4313 209.6075 217.4022 231.7782 235.0376 276.9344 289.0770 295.6006 303.5107 316.9992 329.1097 356.9746 379.8180 384.2202 402.8772 422.3788 433.8420 480.7195 486.7341 508.7892 542.3562 551.2088 570.5994 590.4622 611.9836 645.1126 654.2201 663.9813 682.9357 704.9953 710.4956 738.4232 743.4621 765.1110 783.2502 801.8214 803.2814 806.0518 822.1280 837.1667 866.1467 886.1375 895.4289 906.1113 926.5556 939.6430 943.7191 972.1613 988.0645 996.3660 1016.9107 1043.6923 1059.7918 1081.2833 1087.7900 1100.8801 1109.9979 1111.2245 1120.8411 1144.3996 1149.6647 1163.4430 1198.9006 1211.3327 1218.5323 1244.7805 1251.9743 1263.3018 1276.4847 1281.5950 1328.4382 1356.6080 1364.0609 1377.6976 1391.8668 1402.8571 1408.8581 1438.9259 1443.1205 1455.0217 1466.5977 1467.5933 1471.2242 1471.6406 1474.3077 1479.6466 1488.1888 1515.3360 1532.5440 1548.7675 1584.7215 1607.3953 1620.7023 1633.2743 1643.0354 1657.6611 1670.3639 2977.9747 3005.7339 3040.3144 3075.3119 3117.8227 3119.3282 3128.5096 3140.8936 3146.4569 3147.3387 3163.2047 3178.7102 3181.2080 3194.8180 3217.6140 3282.8475 3375.2819 3409.7761
redmass: 3.1496 4.8766 3.2238 2.4497 2.9024 4.0885 5.2041 3.6947 2.1783 3.4373 3.5303 3.0170 3.2703 4.7135 2.5842 1.5820 1.6994 3.9360 4.5702 3.4028 3.6620 4.2323 4.3712 5.2540 3.5801 3.0134 5.8660 5.9910 3.9082 5.5069 6.1927 4.9283 4.2426 5.9818 3.9550 4.3405 7.1147 4.7320 4.3570 9.4417 2.6874 6.8446 6.5519 7.0378 2.1833 2.3245 6.6543 2.1237 6.5843 1.5815 9.5496 2.1817 5.0089 1.5545 2.0963 6.0975 7.1503 1.4502 6.1854 1.4377 3.9527 3.7504 2.1240 1.4496 2.7559 1.3191 3.5296 1.2545 1.2441 1.0372 1.5043 1.4144 1.8731 1.8723 1.5668 1.9371 2.5216 1.8618 2.5920 2.1029 3.1372 3.4676 2.4918 1.5604 3.8226 3.3685 4.0912 3.3040 1.4976 1.2407 1.0757 1.0957 1.4401 1.6675 1.1429 1.5210 2.2830 2.0382 1.5423 2.8103 4.4034 8.4083 7.1605 4.9110 7.9005 7.6741 1.0551 1.1487 1.0323 1.0309 1.0539 1.1052 1.0927 1.1025 1.1197 1.1008 1.0902 1.1059 1.0877 1.0939 1.0969 1.0920 1.0861 1.0274 1.0920 1.0886
irintensity: 6.3604 0.5451 2.8415 11.4236 20.8893 4.5263 1.9807 1.2812 2.8155 1.3580 0.9903 3.1255 1.6546 3.6481 2.3831 2.5860 16.9113 30.7922 2.9230 3.3914 3.9240 1.2265 2.9729 1.9363 0.7208 2.7073 2.7757 15.5325 2.1587 9.0483 2.0964 2.2808 1.5178 2.6743 0.5203 15.3961 9.7444 8.5856 14.5429 2.4268 0.7553 1.5447 1.1130 6.7294 2.2768 3.0226 14.0408 59.0677 9.9197 17.9327 38.8107 4.7802 6.6822 22.5068 39.3813 8.1034 15.3121 0.0752 226.8918 1.5920 67.1272 109.7731 32.4886 4.5264 39.2184 18.5964 28.9549 0.1543 2.3038 0.0114 1.4656 11.5027 58.5146 124.8989 42.1750 31.3201 28.7785 83.5307 471.5779 13.1131 177.1139 5.7569 23.2478 7.2500 19.7604 74.5337 11.9658 224.0233 18.7299 3.6421 28.5001 68.0603 191.5436 148.6222 15.1872 19.7049 58.4205 197.1903 89.2799 12.5043 146.9470 3.1934 66.1405 30.7250 2.0706 25.9760 66.4457 120.5905 65.1038 68.8003 101.3955 31.1113 16.7920 28.8565 14.1174 14.8592 3.0316 10.5313 3.3602 1.5298 1.1648 9.9155 27.2300 5.8065 58.3445 41.4533
temp: 298.150 k
press: 1.00000 atm
elementType: 8 8 8 8 7 6 6 6 6 6 6 6 6 6 6 6 6 6 6 6 6 6 6 6 6 6 1 1 1 1 1 1 1 1 1 1 1 1 1 1 1 1 1 1
symmnumber: 1
zpe: 905469.8 jmol-1
zpe.correction: 0.344875 hartree
zpe.thermalcorrener: 0.366365 hartree
zpe.thermalcorrenthalpy: 0.367309 hartree
zpe.thermalcorrgfe: 0.294628 hartree
zpe.sumelectzpe: -1164.591920 hartree
zpe.sumelectthermal: -1164.570430 hartree
zpe.sumelectthermalent: -1164.569486 hartree
zpe.sumelectthermalfe: -1164.642167 hartree
dipole: -0.2870 5.8368 0.4486
dipole: 5.8611
quadrupole: -48.9883 -96.7861 -151.5431
quadrupole: 17.9760 -3.6622 0.8849
quadrupole: 50.1175 2.3197 -52.4373 17.9760 -3.6622 0.8849
hfenergy: -1164.9367951 hartree
pointgroup: C01 [X(C21H18N1O4)]
dipole: 0.1065831 2.2918597 -0.2309359 debye
polarizability: 550.979564|-10.6124471|260.013664|-7.4623835|-1.3799848|109.0800272 unknown
InChI: InChI=1S/C21H18NO4/c1-23-17-6-5-12-13-4-3-11-7-18-19(26-10-25-18)9-14(11)20(13)16(22)8-15(12)21(17)24-2/h3-9H,10H2,1-2,22H3
charge 1 multiplicity 1
44 atoms
O  -5.545412 1.625661 0.068149
O  -6.335283 -0.642161 0.07236
O  4.081276 2.057679 -0.023148
O  5.918277 -0.175392 0.005091
N  -0.734693 2.788717 -0.000633
C  -0.668058 0.201032 -0.025066
C  0.222847 -0.943535 -0.048415
C  -2.124714 0.003446 -0.00119
C  1.679403 -0.797893 -0.070975
C  0.021393 1.477221 -0.0278
C  2.266932 0.517454 -0.068362
C  -2.632447 -1.361136 0.001019
C  1.393432 1.646608 -0.04757
C  -0.348305 -2.260799 -0.044856
C  -3.118817 1.058896 0.021388
C  -1.71387 -2.460599 -0.021063
C  -4.038594 -1.662949 0.025154
C  -4.465108 0.729188 0.044879
C  3.687474 0.721801 -0.073298
C  2.577474 -1.904455 -0.097493
C  -4.931863 -0.611557 0.047257
C  4.54411 -0.408878 -0.061153
C  3.962749 -1.709968 -0.094176
C  -6.780183 0.778137 0.091789
C  5.377747 2.506232 -0.588928
C  6.824842 -1.334926 0.048998
H  1.861627 2.639353 -0.043392
H  0.305825 -3.133592 -0.058947
H  -2.919096 2.128834 0.02033
H  -2.1188 -3.477905 -0.018386
H  -4.37457 -2.702669 0.025746
H  2.209601 -2.931558 -0.114813
H  -1.321289 2.873188 0.852058
H  -0.039597 3.558342 -0.001087
H  -1.3476 2.894908 -0.832016
H  4.615234 -2.587502 -0.10123
H  -7.37048 0.985255 -0.814868
H  -7.32703 0.973624 1.027942
H  5.508623 2.116749 -1.613403
H  6.212994 2.178685 0.045609
H  5.299922 3.603816 -0.602871
H  6.741639 -1.941538 -0.871816
H  6.626301 -1.959004 0.939774
H  7.831786 -0.90021 0.117412
