program: Gaussian 09
title: 000158579
version: EM64L-G09RevD.01
frameworkgroup: C1[X(C16H15N3O2)]
method: RPBEPBE
basis: SDD
operation: Freq
keyword: #p
keyword: freq=noraman
keyword: PBEPBE/SDD
title: #p freq=noraman PBEPBE/SDD
converged: NO NO NO NO
title: Mulliken charges:
elementType: O O N N N C C C C C C C C C C C C C C C C H H H H H H H H H H H H H H H
charge: -0.320909 -0.199468 -0.509394 -0.026780 -0.412972 0.335180 0.008167 0.318412 -0.518743 0.253243 -0.321844 -0.382888 0.161922 -0.383427 -0.383459 -0.221082 -0.221074 -0.240947 0.266744 -0.213752 -0.673407 0.251001 0.304299 0.250388 0.244535 0.245114 0.245107 0.331177 0.225958 0.225953 0.228001 0.231389 0.231384 0.215352 0.228408 0.228413
chargesum: 0.00000
title: Mulliken charges with hydrogens summed into heavy atoms:
elementType: O O N N N C C C C C C C C C C C C C C C C
charge: -0.320909 -0.199468 -0.205095 -0.026780 -0.081795 0.335180 0.008167 0.318412 -0.267742 0.253243 -0.071456 -0.138353 0.161922 -0.138313 -0.138352 0.004876 0.004879 -0.012946 0.266744 0.249020 -0.001234
polarizability: 3.62052510e+02 3.78194724e+00 1.57220678e+02 -1.55070601e-02 2.93624921e-02 1.30491767e+02
1716.lowfreq: -55.3695 -36.0716 -12.3410 -0.8418 -0.0004 -0.0002 0.0010 5.2908 22.9013
frequency: -55.3308 -33.8415 8.7570 35.0557 42.8198 64.8066 80.4925 117.0334 159.3127 175.2760 200.3333 226.5365 251.8203 266.3001 310.0871 311.7975 318.5808 378.4320 398.7227 413.5621 442.3352 468.3232 495.7247 536.6284 560.9191 594.3474 609.3996 625.3710 654.3238 677.4214 689.5642 699.5216 705.7502 723.8530 733.4789 769.6187 773.0354 798.7450 825.3707 833.0062 852.6270 871.8357 874.0705 907.4724 920.2537 958.2186 959.8106 973.2333 987.5745 993.8819 996.0444 1010.7341 1037.6686 1050.7619 1075.7651 1110.6816 1123.8837 1141.1488 1143.3182 1171.1518 1185.4744 1186.5227 1213.8465 1235.8063 1250.9944 1264.5040 1303.2634 1307.5147 1336.1768 1360.9920 1363.1344 1366.7960 1396.8858 1427.3173 1450.5176 1463.5617 1466.3030 1476.1919 1489.7451 1499.2740 1518.5051 1557.5152 1581.7168 1594.7008 1611.4817 1642.8157 1696.1948 2993.7526 3004.0197 3061.2580 3090.7410 3105.2694 3119.7241 3125.6754 3138.3237 3139.3133 3142.0330 3146.7991 3162.0040 3170.3465 3556.3855 3589.1335
redmass: 3.9781 2.7831 4.9144 4.3912 4.9925 4.2991 4.9918 3.5839 5.1039 4.9977 5.6685 4.7115 1.1930 6.0814 5.2054 4.3950 5.7467 3.7830 2.8388 5.3047 3.0862 4.9651 1.2902 3.6778 6.5914 1.2188 6.0497 6.0747 4.0133 7.4863 7.3268 8.9240 1.8027 5.4179 4.3735 3.9883 2.1249 1.0935 4.3656 1.4858 1.2474 1.5026 4.8517 4.7269 1.4978 1.3413 7.3622 1.3817 5.9920 1.3110 3.5319 3.0193 1.8068 4.4468 1.6023 2.2143 1.6413 1.4742 2.7789 1.0535 1.1731 1.7793 2.3195 2.1530 1.1251 2.1762 2.8756 1.3778 2.2350 1.5893 3.4678 6.6506 1.2673 2.2052 3.8099 1.0411 2.6396 1.0525 1.0952 3.3226 1.9498 6.5670 5.9909 8.8409 6.2432 7.1338 9.3277 1.0356 1.0580 1.1069 1.0985 1.1025 1.0843 1.0876 1.0923 1.0899 1.0920 1.0968 1.1018 1.0964 1.0764 1.0811
irintensity: 0.7219 0.0125 0.9972 0.7584 0.6399 1.6056 0.0876 2.4032 4.5193 3.9338 1.0948 10.6833 1.3515 1.9278 0.2627 0.0440 7.6117 7.3728 0.0000 1.5320 10.5827 5.3090 9.8920 13.6045 2.0291 167.0763 2.0908 1.3375 9.2013 3.3172 16.7604 50.6349 58.6253 7.0400 1.1178 0.5114 40.9258 4.1090 1.7946 43.4282 0.7701 19.3956 0.2287 2.1028 1.5663 0.6668 50.2847 0.0040 1.0590 0.1137 58.0067 2.3376 7.0134 406.7966 7.9361 37.0479 48.6100 4.9034 550.9694 0.0218 5.3334 13.3573 13.4220 53.5377 0.0015 8.7391 19.1120 0.5494 56.3965 7.2318 6.5538 0.1027 24.9563 6.9497 61.7554 12.2670 38.8116 20.6409 23.8240 12.6436 323.2135 597.4075 1.4433 229.8846 14.0604 53.1191 265.8191 23.4312 25.9184 9.9124 31.5690 44.6343 2.8767 0.4746 23.6526 6.3298 5.0906 40.8270 28.8750 7.1723 43.7863 33.1774
temp: 298.150 k
press: 1.00000 atm
elementType: 8 8 7 7 7 6 6 6 6 6 6 6 6 6 6 6 6 6 6 6 6 1 1 1 1 1 1 1 1 1 1 1 1 1 1 1
symmnumber: 1
zpe: 735279.5 jmol-1
zpe.correction: 0.280053 hartree
zpe.thermalcorrener: 0.296975 hartree
zpe.thermalcorrenthalpy: 0.297919 hartree
zpe.thermalcorrgfe: 0.232709 hartree
zpe.sumelectzpe: -931.946373 hartree
zpe.sumelectthermal: -931.929452 hartree
zpe.sumelectthermalent: -931.928508 hartree
zpe.sumelectthermalfe: -931.993717 hartree
dipole: 0.9929 -5.6838 0.0038
dipole: 5.7699
quadrupole: -92.9994 -120.8536 -119.2807
quadrupole: -13.0764 0.0031 0.0098
quadrupole: 18.0452 -9.8090 -8.2361 -13.0764 0.0031 0.0098
hfenergy: -932.2264265 hartree
pointgroup: C01 [X(C16H15N3O2)]
dipole: 0.3827374 -2.2375502 0.0015121 debye
polarizability: 362.0766601|3.058722|157.196528|-0.0154033|0.0294171|130.4917666 unknown
InChI: InChI=1S/C16H15N3O2/c1-2-21-16(20)19-15-17-13-9-8-12(10-14(13)18-15)11-6-4-3-5-7-11/h3-10,18-19H,2H2,1H3
charge 0 multiplicity 1
36 atoms
O  5.68359 -0.722796 0.000024
O  4.721348 1.432602 -0.000234
N  1.076166 -1.074736 -0.000142
N  1.687567 1.138247 -0.001903
N  3.442364 -0.584462 -0.000447
C  -0.132179 -0.349019 -0.000684
C  0.274327 1.028871 -0.001774
C  -2.460618 0.279734 -0.000927
C  -1.480988 -0.745598 -0.000276
C  -3.922044 -0.076036 -0.000245
C  -0.70812 2.042128 -0.00248
C  -2.064521 1.653639 -0.002023
C  2.121027 -0.12576 -0.000908
C  -4.626006 -0.243504 1.221542
C  -4.626109 -0.248228 -1.221318
C  -6.000189 -0.575701 1.222974
C  -6.000296 -0.580421 -1.22133
C  -6.692112 -0.745934 0.001174
C  4.608356 0.193201 -0.000082
C  7.036855 -0.103646 0.000163
C  8.04701 -1.247042 0.000492
H  -1.785895 -1.797603 0.000618
H  1.163725 -2.089377 0.000845
H  -0.41323 3.095602 -0.003315
H  -2.847246 2.420107 -0.002515
H  -4.091002 -0.108562 2.168802
H  -4.091206 -0.116909 -2.169144
H  3.61033 -1.591979 -0.000299
H  -6.528677 -0.699796 2.175308
H  -6.528884 -0.708167 -2.173128
H  -7.75762 -1.002865 0.001713
H  7.128718 0.539979 -0.894166
H  7.128418 0.540214 0.894354
H  9.072774 -0.834913 0.000609
H  7.927578 -1.879308 0.897014
H  7.927889 -1.879564 -0.895889
