program: Gaussian 09
title: 000158576
version: EM64L-G09RevD.01
frameworkgroup: C1[X(C13H14N2O11)]
method: RPBEPBE
basis: SDD
operation: Freq
keyword: #p
keyword: freq=noraman
keyword: PBEPBE/SDD
title: #p freq=noraman PBEPBE/SDD
converged: YES YES NO NO
title: Mulliken charges:
elementType: O O O O O O O O O O O N N C C C C C C C C C C C C C H H H H H H H H H H H H H H
charge: -0.250415 -0.246893 -0.460314 -0.443778 -0.469123 -0.473610 -0.168886 -0.163998 -0.181295 -0.208732 -0.170650 0.038296 -0.000638 -0.153419 -0.091558 -0.155069 -0.002149 -0.096060 0.154213 -0.401866 0.323700 0.264557 0.207494 -0.356638 -0.344716 -0.204493 0.227759 0.241000 0.245624 0.225194 0.246534 0.369536 0.366554 0.382996 0.283741 0.239921 0.401634 0.285224 0.284490 0.255835
chargesum: 0.00000
title: Mulliken charges with hydrogens summed into heavy atoms:
elementType: O O O O O O O O O O O N N C C C C C C C C C C C C C
charge: -0.250415 -0.246893 -0.090778 -0.077224 -0.086127 -0.071977 -0.168886 -0.163998 -0.181295 -0.208732 -0.170650 0.038296 -0.000638 0.074340 0.149441 0.090555 0.223045 0.150474 0.154213 0.121796 0.323700 0.264557 0.207494 -0.071414 -0.060226 0.051341
polarizability: 2.60749714e+02 -1.90010999e+00 2.23833286e+02 1.09675189e+01 -3.32062700e+00 1.19547640e+02
1716.lowfreq: -6.4372 -2.7554 -0.0008 -0.0006 0.0005 3.6751 17.4365 19.1234 24.0781
frequency: 17.4357 19.0956 24.0716 33.5993 48.4121 56.2351 57.6946 76.6973 96.2762 102.4535 111.4441 167.4093 171.0869 175.5268 195.0898 211.4975 229.3655 262.5714 274.4820 280.1579 295.8781 310.8187 318.5484 357.4540 367.3140 378.4496 391.6341 394.6381 400.3019 413.6619 431.2174 447.9907 494.0412 506.8881 525.0764 538.9774 544.8008 560.6401 577.9602 588.0720 595.8395 617.1525 639.7396 667.8001 671.8461 687.3044 710.0085 728.4879 753.4741 816.5483 822.1073 846.1964 858.9271 905.2074 911.9016 942.1111 964.7196 968.6229 989.7584 993.8779 997.9032 1026.6802 1044.9425 1058.6531 1064.0311 1074.2375 1083.1645 1087.7098 1105.5682 1120.4685 1165.7841 1175.3766 1198.0742 1204.4473 1211.7447 1215.4000 1222.0426 1223.3006 1228.5827 1249.6314 1256.2277 1268.8033 1295.9604 1300.9176 1309.5531 1325.5244 1340.9494 1364.1946 1378.8896 1380.9705 1383.3808 1393.5133 1398.3345 1413.6618 1435.5984 1452.9038 1471.8316 1577.9630 1604.6468 1702.1653 2916.0511 2928.5528 2955.7721 2992.9938 3003.7323 3028.3198 3134.5116 3165.0779 3182.0064 3192.4463 3498.4557 3519.3024 3545.7366 3558.8045
redmass: 8.4917 10.0409 9.5891 7.3850 10.7757 8.4644 10.4066 11.4440 7.6793 7.5225 10.2267 6.1154 6.8598 7.8766 6.7583 7.5587 4.6783 5.0437 5.2854 6.3829 6.6639 6.3697 9.2206 5.0993 3.4030 5.1167 3.8652 3.4501 2.2214 2.5043 5.6838 1.2354 4.1160 3.4422 2.0418 1.8091 4.2325 6.5905 3.0511 3.0060 4.8464 1.9238 4.2874 7.5695 8.4803 4.1642 8.6524 3.1402 7.9975 2.4373 2.7451 6.9071 6.7114 7.3378 7.0699 1.4050 5.0079 2.9841 3.4758 1.4163 4.9725 4.1538 3.2311 2.7270 3.7537 2.7183 2.1357 2.7324 9.2898 3.7195 1.4613 1.3272 1.4017 2.3054 6.0300 1.2348 1.3145 3.8594 1.4567 1.3163 1.2649 1.4841 1.2280 1.2343 1.2109 1.2432 1.3724 2.2706 2.4585 4.0829 3.0605 3.2047 1.4860 1.7665 2.3301 2.6094 1.2538 6.7411 7.8749 9.8836 1.0797 1.0831 1.0820 1.0847 1.0853 1.0653 1.0972 1.0883 1.0926 1.0998 1.0652 1.0641 1.0656 1.0655
irintensity: 1.8420 1.3243 3.6837 0.6447 0.7344 0.3709 3.6518 1.8987 2.6803 1.0012 0.5083 2.8199 3.0427 3.5406 1.5615 4.9982 6.6548 8.1710 6.5517 1.8596 6.9350 2.5083 10.0964 9.5469 4.9680 10.7016 23.0922 30.6045 27.6598 51.2257 6.6942 166.0849 4.8815 15.2097 40.1074 87.1129 4.4444 17.5463 52.7358 83.2386 25.3549 90.0733 38.7933 12.9916 29.2587 17.1044 0.4521 41.0518 16.4126 20.6379 22.0961 16.1552 17.8838 68.9905 130.1209 1.3755 22.8852 177.5194 402.7175 20.1300 62.9670 51.8752 48.3781 51.7816 6.4303 9.2272 2.4613 101.8598 2.9240 126.5817 12.0907 8.2213 14.6514 9.0104 235.7729 20.6958 13.3433 38.0463 34.1759 41.2301 21.0572 29.0862 7.1838 41.8838 23.4244 28.6004 26.0140 52.8192 51.8748 63.6365 98.7229 18.1009 16.0470 22.2500 13.6969 32.7468 5.1988 12.6744 0.2712 204.5308 21.6565 20.1079 22.8371 5.6787 71.7904 9.6395 1.0408 3.8115 2.1121 1.3972 94.5278 29.7456 19.5268 28.0703
temp: 298.150 k
press: 1.00000 atm
elementType: 8 8 8 8 8 8 8 8 8 8 8 7 7 6 6 6 6 6 6 6 6 6 6 6 6 6 1 1 1 1 1 1 1 1 1 1 1 1 1 1
symmnumber: 1
zpe: 735596.3 jmol-1
zpe.correction: 0.280174 hartree
zpe.thermalcorrener: 0.304758 hartree
zpe.thermalcorrenthalpy: 0.305702 hartree
zpe.thermalcorrgfe: 0.222685 hartree
zpe.sumelectzpe: -1438.574289 hartree
zpe.sumelectthermal: -1438.549705 hartree
zpe.sumelectthermalent: -1438.548761 hartree
zpe.sumelectthermalfe: -1438.631778 hartree
dipole: 0.7901 -0.5091 1.1881
dipole: 1.5149
quadrupole: -97.8081 -168.8824 -152.0759
quadrupole: 22.9703 2.7970 4.7370
quadrupole: 41.7807 -29.2936 -12.4871 22.9703 2.7970 4.7370
hfenergy: -1438.8544632 hartree
pointgroup: C01 [X(C13H14N2O11)]
dipole: 0.2294266 0.310358 -0.4541873 debye
polarizability: 255.8433744|9.9120163|224.6090357|-23.3586496|9.0590756|123.6782306 unknown
InChI: InChI=1S/C13H14N2O11/c16-8-9(17)11(12(19)20)26-13(10(8)18)25-4-5-6(14(21)22)2-1-3-7(5)15(23)24/h1-3,8-11,13,16-19H,4H2
charge 0 multiplicity 1
40 atoms
O  1.966788 -0.620584 -0.308294
O  -0.120387 0.03729 0.531203
O  3.733034 2.68999 1.545089
O  0.89776 2.651623 1.145561
O  5.242699 1.257716 -0.416392
O  5.364047 -1.298736 -1.33793
O  3.449358 -2.594466 -1.575824
O  -2.384634 3.04743 0.035155
O  -3.724942 -3.906369 0.166814
O  -1.388549 1.757998 -1.554428
O  -1.688847 -3.290577 0.985467
N  -2.166736 1.920039 -0.5377
N  -2.855496 -3.017991 0.514211
C  3.134511 1.878577 0.483524
C  1.742545 1.472837 0.99427
C  4.020047 0.67376 0.132901
C  1.07645 0.549198 -0.035046
C  3.246109 -0.211362 -0.889895
C  3.959706 -1.502517 -1.292537
C  -0.92339 -0.804036 -0.390021
C  -2.378773 -0.567085 -0.016189
C  -2.942146 0.740205 -0.043656
C  -3.276185 -1.587284 0.396934
C  -4.266527 1.02587 0.345468
C  -4.626175 -1.345192 0.741209
C  -5.117207 -0.028151 0.733508
H  3.017076 2.490594 -0.439031
H  1.84829 0.921692 1.951448
H  4.228582 0.07368 1.043111
H  0.883353 1.080667 -0.996317
H  3.09659 0.391438 -1.817904
H  4.647815 2.937176 1.252321
H  1.403797 3.307185 1.692685
H  5.825138 0.510091 -0.718548
H  -0.624801 -1.850824 -0.256661
H  -0.748514 -0.488519 -1.434275
H  5.811378 -2.138345 -1.630431
H  -4.611109 2.063184 0.331308
H  -5.261019 -2.190245 1.019547
H  -6.151236 0.176443 1.024146
