program: Gaussian 09
title: 000158574
version: EM64L-G09RevD.01
frameworkgroup: C1[X(C14H20N2O3)]
method: RPBEPBE
basis: SDD
operation: Freq
keyword: #p
keyword: freq=noraman
keyword: PBEPBE/SDD
title: #p freq=noraman PBEPBE/SDD
converged: YES YES NO NO
title: Mulliken charges:
elementType: O O O N N C C C C C C C C C C C C C C H H H H H H H H H H H H H H H H H H H H
charge: -0.458750 -0.274363 -0.419392 -0.350992 -0.046032 0.262946 -0.426662 -0.078947 -0.730586 -0.689861 -0.705191 -0.310602 0.304737 0.239237 -0.515066 0.316952 -0.326459 -0.368203 -0.232601 0.284131 0.240023 0.198003 0.204565 0.215990 0.207814 0.225112 0.199399 0.225591 0.207701 0.209774 0.204643 0.254400 0.230515 0.231851 0.343859 0.242419 0.260177 0.262859 0.361007
chargesum: 0.00000
title: Mulliken charges with hydrogens summed into heavy atoms:
elementType: O O O N N C C C C C C C C C C C C C C
charge: -0.114891 -0.274363 -0.058385 -0.066860 -0.046032 0.262946 0.011365 0.125618 -0.081670 -0.057171 -0.036373 0.151764 0.304737 0.239237 -0.272646 0.316952 -0.066282 -0.105344 -0.232601
polarizability: 2.32047929e+02 9.31370210e+00 1.78680964e+02 2.30446408e+01 1.69837090e+01 1.28531054e+02
1716.lowfreq: -13.5145 -5.7774 -0.0004 0.0003 0.0005 4.7209 14.3042 24.3168 42.6874
frequency: 12.1709 24.2852 42.6759 61.6483 74.7748 89.1470 99.5735 119.6359 150.6038 153.5956 166.3101 210.1291 218.1950 235.9391 241.5530 249.1630 259.7932 261.4245 299.0303 330.9263 344.7747 367.3786 377.2326 402.1624 407.8253 423.9124 435.1916 442.0051 473.3478 499.5552 514.2707 521.7276 590.7002 622.5894 636.1460 696.9075 720.5815 724.8710 752.5741 763.3978 815.6168 828.1465 831.1376 884.0693 900.6919 909.4892 923.8786 942.1482 944.7895 958.1652 983.6470 1014.0082 1022.9586 1048.4933 1058.7510 1086.1384 1104.0225 1115.6855 1131.8413 1180.2802 1186.9593 1197.8011 1213.9257 1225.4365 1237.6551 1240.0934 1269.5297 1275.6526 1290.1896 1305.1709 1346.4201 1369.4112 1373.4758 1374.9698 1386.4915 1395.7613 1402.3268 1427.8031 1449.6484 1451.8141 1457.1056 1464.1262 1465.0361 1474.3369 1481.9478 1490.4984 1495.1916 1499.5421 1589.9481 1615.5122 2171.1264 2944.2588 2961.1341 2968.3943 2972.7628 2979.2420 2994.9016 3026.8236 3062.9625 3065.6379 3065.9783 3070.6764 3073.6294 3084.1353 3090.8986 3149.1552 3161.1029 3190.2138 3416.7505 3567.2788 3580.1431
redmass: 6.5552 4.0987 3.1558 4.4585 5.5164 4.1385 6.1268 3.3342 5.4007 4.5397 1.3921 1.4114 5.2292 1.6476 1.7434 1.1471 1.1223 4.7829 2.9718 2.3381 4.3583 2.6829 1.1333 5.1963 5.1218 3.5280 3.1220 2.5027 2.7034 3.5761 5.7322 4.1956 5.1794 3.7524 4.5411 6.6445 2.8916 2.7753 2.6911 2.5101 1.8145 1.9468 2.1752 2.2629 2.3461 2.1784 1.6917 1.2039 2.2889 1.3469 3.2814 1.4878 1.4370 2.2037 2.0270 2.1796 2.0170 3.1465 1.6558 1.7864 1.2863 1.8824 2.5432 1.3674 1.2013 2.5923 1.7673 1.5557 1.3811 2.5552 1.4018 1.2927 1.3182 1.2603 3.2776 1.4499 1.5475 3.0481 1.1059 1.1984 1.0946 1.0521 1.0520 1.0746 1.0649 1.1593 1.0587 2.5903 6.6193 6.5768 12.6228 1.0658 1.0791 1.0353 1.0356 1.0363 1.0572 1.0966 1.0993 1.0994 1.1082 1.0985 1.0993 1.1005 1.0996 1.0910 1.0901 1.0967 1.0731 1.0661 1.0661
irintensity: 1.6094 1.1219 1.3496 0.8542 3.0081 0.9238 0.5201 2.0077 1.2083 1.5499 0.4814 1.0402 3.5940 89.0565 56.0203 0.7154 0.5013 3.2717 8.9199 0.7603 6.1686 2.0106 134.6075 6.7465 16.1048 10.7966 8.7756 3.1920 1.9416 13.5421 5.3174 3.0472 10.6644 8.7819 13.0735 6.4100 32.9955 1.6200 14.3355 24.2442 1.3534 15.5384 86.6474 10.1232 14.6284 12.0497 9.6199 0.1124 6.6540 0.4284 82.6419 3.0855 3.1568 18.3172 37.8578 16.6641 75.8955 40.0983 339.8702 38.4684 6.3655 51.0899 47.7417 19.3106 44.9476 41.2859 47.4717 18.0595 5.3121 86.2941 2.3482 17.1423 14.0606 28.1762 1.2662 17.3699 10.3361 60.1905 15.6153 47.4024 9.8811 3.3118 0.5532 11.7491 14.7607 33.3770 17.9198 61.3176 84.0535 246.2124 75.4745 20.4225 42.5857 33.0232 33.4831 16.8591 37.7827 52.9678 4.1464 11.3638 21.5366 71.5594 59.5204 4.5573 69.7784 6.5575 2.3733 2.2310 1.4848 6.8830 55.9848
temp: 298.150 k
press: 1.00000 atm
elementType: 8 8 8 7 7 6 6 6 6 6 6 6 6 6 6 6 6 6 6 1 1 1 1 1 1 1 1 1 1 1 1 1 1 1 1 1 1 1 1
symmnumber: 1
zpe: 835906.6 jmol-1
zpe.correction: 0.318380 hartree
zpe.thermalcorrener: 0.339313 hartree
zpe.thermalcorrenthalpy: 0.340257 hartree
zpe.thermalcorrgfe: 0.267407 hartree
zpe.sumelectzpe: -879.164692 hartree
zpe.sumelectthermal: -879.143759 hartree
zpe.sumelectthermalent: -879.142815 hartree
zpe.sumelectthermalfe: -879.215665 hartree
dipole: 0.7469 3.4904 2.4311
dipole: 4.3187
quadrupole: -104.7636 -112.0491 -118.6047
quadrupole: -1.6337 5.2501 0.2385
quadrupole: 7.0422 -0.2433 -6.7989 -1.6337 5.2501 0.2385
hfenergy: -879.4830718 hartree
pointgroup: C01 [X(C14H20N2O3)]
dipole: 0.0627626 -1.4218719 -0.9280585 debye
polarizability: 226.1015479|-15.0957854|182.7940774|-26.1468136|19.3950461|130.3643215 unknown
InChI: InChI=1S/C14H20N2O3/c1-14(2,3)16-8-12(18)9-19-13-6-11(17)5-4-10(13)7-15/h4-6,12,16-18H,8-9H2,1-3H3
charge 0 multiplicity 1
39 atoms
O  -1.324088 -2.941458 1.43485
O  0.372527 -0.673014 0.144134
O  4.906338 -1.528398 -1.618972
N  -2.420967 0.069033 -0.589131
N  0.258528 2.593372 1.267456
C  -3.513829 1.103222 -0.61131
C  -2.345069 -0.828264 0.583311
C  -1.587362 -2.131134 0.228231
C  -3.209647 2.014148 -1.825541
C  -4.878548 0.403506 -0.826648
C  -3.543362 1.961182 0.688791
C  -0.217617 -1.906781 -0.419344
C  1.683017 -0.333011 -0.154024
C  2.071095 0.988297 0.239037
C  2.612035 -1.188267 -0.787999
C  3.935317 -0.731276 -1.003532
C  3.407369 1.411511 0.008334
C  4.343417 0.563919 -0.604926
C  1.094324 1.865217 0.814927
H  -1.509539 0.538399 -0.702419
H  -1.844188 -0.373302 1.465231
H  -3.372011 -1.108372 0.887521
H  -2.196687 -2.713972 -0.495889
H  -2.24337 2.538022 -1.691479
H  -3.994701 2.781836 -1.945543
H  -3.156112 1.413703 -2.751349
H  -5.146354 -0.250503 0.024093
H  -4.848252 -0.213109 -1.742318
H  -5.68241 1.155116 -0.928686
H  -3.779554 1.339781 1.572809
H  -4.31443 2.751227 0.619767
H  -2.563496 2.443777 0.86351
H  -0.317392 -1.773866 -1.512764
H  0.417184 -2.782558 -0.188723
H  -2.143114 -2.974653 1.990882
H  2.319395 -2.195113 -1.10373
H  3.700292 2.420994 0.311922
H  5.372954 0.879384 -0.788435
H  4.547508 -2.418196 -1.861442
