program: Gaussian 09
title: 000158503
version: EM64L-G09RevD.01
frameworkgroup: C1[X(C18H13NO4)]
method: RPBEPBE
basis: SDD
operation: Freq
keyword: #p
keyword: freq=noraman
keyword: PBEPBE/SDD
title: #p freq=noraman PBEPBE/SDD
converged: YES YES NO NO
title: Mulliken charges:
elementType: O O O O N C C C C C C C C C C C C C C C C C C H H H H H H H H H H H H H
charge: -0.300761 -0.299080 -0.404965 -0.152517 0.084947 0.192061 0.266236 0.238294 0.568467 -0.353965 0.234126 -0.030207 -0.242908 -0.170841 0.061999 -0.369405 -0.328626 -0.399540 -0.407644 -0.244763 -0.250346 -0.522345 -0.514115 0.310756 0.190656 0.295640 0.254185 0.228822 0.237511 0.370278 0.277565 0.232105 0.225740 0.223450 0.233596 0.265596
chargesum: 0.00000
title: Mulliken charges with hydrogens summed into heavy atoms:
elementType: O O O O N C C C C C C C C C C C C C C C C C C
charge: -0.300761 -0.299080 -0.034687 -0.152517 0.084947 0.192061 0.266236 0.238294 0.568467 -0.353965 0.234126 -0.030207 -0.242908 -0.170841 0.061999 -0.058649 -0.137970 -0.103900 -0.153459 -0.015941 -0.012836 0.213065 0.208527
polarizability: 3.31207163e+02 1.02685278e+01 2.95965035e+02 1.44703579e+00 4.71876527e+00 9.52104370e+01
1716.lowfreq: -8.9301 -3.0162 -0.0004 0.0002 0.0007 2.6857 31.1306 37.4304 62.8751
frequency: 31.0995 37.3902 62.8628 70.3320 93.9290 108.7780 127.6244 144.3383 149.8006 167.7741 202.1334 209.5894 239.1340 264.3887 271.1050 303.7985 312.2395 331.8729 335.8995 347.7009 360.1350 381.9974 397.6949 434.0865 452.7886 460.3882 511.9905 517.7800 532.0877 565.4826 600.3153 630.5044 664.5925 667.6914 678.3452 702.1905 751.8634 765.8799 779.4614 804.4270 814.1197 839.2102 864.7974 889.5321 892.7033 936.1048 942.7262 951.3054 955.1955 996.8179 999.5401 1013.2031 1047.1867 1059.6746 1088.5147 1104.0531 1110.6411 1113.5418 1151.0335 1152.1808 1161.0537 1177.0799 1192.6898 1203.1293 1226.5736 1263.1432 1285.0360 1299.2162 1342.8411 1355.0255 1377.5270 1387.5156 1398.1196 1405.7061 1429.9654 1434.4466 1445.7920 1456.0564 1458.5330 1470.0500 1478.7414 1479.9563 1486.3199 1523.1037 1557.5417 1560.0397 1573.8301 1605.7465 1613.5832 2988.3804 2989.2242 3098.1549 3099.1864 3100.4261 3130.9092 3134.3418 3136.1160 3147.1608 3148.3772 3164.7893 3214.2738 3581.2417
redmass: 6.7685 3.8514 2.3787 3.3686 3.8102 2.1574 1.7363 2.7143 1.7224 2.3245 3.8562 4.0775 2.6363 1.9994 4.3106 6.2217 7.4550 6.1450 7.1469 9.5824 7.6094 5.4508 5.8055 4.3135 7.0335 6.9803 6.5683 3.7805 5.8703 8.3608 5.8404 7.0553 7.3183 5.3556 6.3111 4.7731 5.5728 5.1417 1.5905 4.5883 1.6344 4.9147 7.6769 3.1308 3.1542 7.9144 2.4724 6.5263 1.6739 3.5970 1.6728 1.3614 2.2761 4.9835 2.4426 1.2387 1.2715 2.0980 1.6834 1.4693 2.2661 1.2010 2.4695 1.7568 1.8698 1.7558 4.7018 2.7724 3.3490 5.6402 7.3118 4.1743 3.8678 2.8815 1.4187 1.2807 2.7437 1.1012 1.0976 3.3637 1.6175 1.4189 1.0576 8.7684 8.7034 6.8229 7.1595 7.3918 6.8730 1.0316 1.0317 1.1015 1.0882 1.1010 1.0867 1.1049 1.1053 1.0958 1.0913 1.0991 1.0926 1.0655
irintensity: 2.7266 1.3783 5.1529 1.5557 5.2304 4.3193 1.2564 6.0631 2.5392 0.3461 12.5804 6.2825 47.2013 50.9741 12.3524 3.2303 8.4340 11.3825 4.5391 1.3710 1.5340 2.6740 2.6811 0.5261 10.6948 4.4916 4.3729 2.0579 8.1589 3.4388 7.7320 7.1323 5.8688 9.3863 16.5764 9.6104 6.2917 7.2922 37.1585 29.1899 64.3129 4.3334 31.2572 22.7446 36.9061 21.3677 2.6871 28.1585 2.9460 57.9083 15.6923 0.3428 7.7468 88.2729 4.7074 17.6415 7.0754 59.0745 33.5701 3.8141 19.4036 10.6616 65.0725 231.6549 60.0780 5.1491 103.6397 157.0817 116.4161 12.4116 43.1954 67.0928 18.5374 49.6092 40.6886 15.4742 35.5614 5.7450 21.7779 61.1735 65.5273 2.3470 19.3862 45.0996 46.0974 88.4536 88.8856 27.6920 8.1695 81.6193 66.4039 29.2068 18.3666 24.0111 6.6338 12.8505 9.5135 38.1242 11.0041 28.3087 9.6877 43.5055
temp: 298.150 k
press: 1.00000 atm
elementType: 8 8 8 8 7 6 6 6 6 6 6 6 6 6 6 6 6 6 6 6 6 6 6 1 1 1 1 1 1 1 1 1 1 1 1 1
symmnumber: 1
zpe: 699663.0 jmol-1
zpe.correction: 0.266488 hartree
zpe.thermalcorrener: 0.285966 hartree
zpe.thermalcorrenthalpy: 0.286910 hartree
zpe.thermalcorrgfe: 0.218439 hartree
zpe.sumelectzpe: -1047.740787 hartree
zpe.sumelectthermal: -1047.721309 hartree
zpe.sumelectthermalent: -1047.720364 hartree
zpe.sumelectthermalfe: -1047.788835 hartree
dipole: 6.6644 -3.0274 -0.2667
dipole: 7.3247
quadrupole: -125.7045 -121.4683 -132.6401
quadrupole: 23.4013 -1.8504 -2.5375
quadrupole: 0.8998 5.1360 -6.0358 23.4013 -1.8504 -2.5375
hfenergy: -1048.0072742 hartree
pointgroup: C01 [X(C18H13N1O4)]
dipole: 2.5494111 1.3327425 0.1694824 debye
polarizability: 331.9978502|-8.3467235|295.0689121|7.2588559|-0.1618765|95.3158733 unknown
InChI: InChI=1S/C18H13NO4/c1-22-17-13-9-5-3-4-6-10(9)15(20)14-12(13)11(7-8-19-14)16(21)18(17)23-2/h3-8,21H,1-2H3
charge 0 multiplicity 1
36 atoms
O  0.88791 2.704855 -0.08173
O  3.428885 1.730551 -0.006986
O  3.943115 -1.022406 0.063885
O  -3.306822 -2.286822 -0.294012
N  -0.736486 -3.269504 -0.014811
C  0.147746 -0.95709 0.01331
C  -0.101439 0.467876 -0.008185
C  -1.50614 0.951756 0.018184
C  1.493706 -1.490413 0.043517
C  -0.924155 -1.924767 -0.038726
C  -2.582572 0.006251 -0.074553
C  1.040918 1.315578 -0.052183
C  -2.351823 -1.462972 -0.151343
C  2.610271 -0.587113 0.041685
C  2.387317 0.794863 0.010821
C  -1.863903 2.327572 0.162902
C  1.666712 -2.906168 0.074913
C  -3.934703 0.438176 -0.070584
C  0.544751 -3.742734 0.057128
C  -3.209972 2.740333 0.174287
C  -4.259454 1.798434 0.045061
C  1.469866 3.437096 -1.236311
C  4.412891 1.673162 1.101072
H  -1.073007 3.066502 0.277292
H  2.659024 -3.373515 0.117898
H  -4.70704 -0.333287 -0.152241
H  0.65157 -4.831945 0.093424
H  -3.440358 3.805482 0.290642
H  -5.305077 2.123675 0.049565
H  4.001803 -2.007798 0.005954
H  2.561854 3.302247 -1.26549
H  1.211003 4.491528 -1.058525
H  1.00257 3.084076 -2.174081
H  3.893665 1.770377 2.072346
H  5.069851 2.540008 0.936229
H  4.988521 0.734938 1.061745
