program: Gaussian 09
title: 000158710
version: EM64L-G09RevD.01
frameworkgroup: C1[X(C20H28O7)]
method: RPBEPBE
basis: SDD
operation: Freq
keyword: #pfreq=noraman
keyword: PBEPBE/SDD
title: #p freq=noraman PBEPBE/SDD
converged: YES YES NO NO
title: Mulliken charges:
elementType: O O O O O O O C C C C C C C C C C C C C C C C C C C C H H H H H H H H H H H H H H H H H H H H H H H H H H H H
charge: -0.235319 -0.270144 -0.417342 -0.469521 -0.196700 -0.219643 -0.261002 -0.210340 -0.043668 -0.052137 -0.155371 0.232254 -0.597236 0.295358 0.071138 0.138401 0.380296 -0.804702 -0.608482 -0.303480 -0.672544 0.306385 -0.836505 -0.554607 -0.021212 -0.712893 -0.712362 0.250454 0.266630 0.229085 0.199832 0.254806 0.230017 0.207120 0.265648 0.252250 0.265843 0.238215 0.237401 0.349779 0.275919 0.247661 0.377176 0.256681 0.258337 0.232123 0.268081 0.243355 0.200061 0.244773 0.209604 0.205588 0.251071 0.207532 0.206338
chargesum: 0.00000
title: Mulliken charges with hydrogens summed into heavy atoms:
elementType: O O O O O O O C C C C C C C C C C C C C C C C C C C C
charge: -0.235319 -0.270144 -0.067562 -0.092345 -0.196700 -0.219643 -0.261002 0.040114 0.222962 0.176948 0.044461 0.232254 -0.112413 0.295358 0.071138 0.138401 0.380296 -0.079685 -0.104424 -0.066079 -0.148963 0.306385 -0.089363 -0.043171 0.178848 -0.052929 -0.047421
polarizability: 2.43778264e+02 7.51939015e+00 2.36787794e+02 4.00127138e+00 -1.18188401e+01 2.17308275e+02
1716.lowfreq: -12.1814 -9.2647 -0.0002 0.0003 0.0006 7.4719 25.4918 35.2669 43.0526
frequency: 24.3761 35.1758 43.0144 47.3869 56.3702 67.7156 83.1742 92.7359 108.9937 120.1483 123.9421 127.4365 150.0320 163.5981 165.3129 181.4178 190.9137 206.9283 220.0341 230.6223 243.6232 253.7810 256.5137 269.4464 270.3128 278.1238 289.3409 297.3312 312.9674 323.0502 330.9339 343.1861 356.4872 363.4855 390.6749 396.8074 418.3862 429.0730 443.4303 479.5382 498.8515 513.3874 531.7562 534.2986 552.3061 576.1641 585.4443 601.1346 629.4138 645.0458 675.3231 709.6561 722.8238 753.8459 777.1234 785.9524 787.6045 795.8114 837.4896 844.5903 851.1807 868.9821 880.9650 891.1639 919.5355 922.7674 926.8306 931.2281 941.6770 963.1920 966.7462 983.9746 990.0670 992.0475 1008.1150 1024.2460 1033.5186 1045.7955 1059.5290 1073.0130 1080.1325 1092.7408 1112.1338 1113.6702 1122.3229 1126.9468 1135.0385 1149.3388 1162.1789 1188.0136 1195.3808 1202.0429 1232.4456 1235.6902 1236.5529 1249.2924 1271.1132 1281.1750 1288.0259 1303.6065 1307.9216 1315.5800 1329.4370 1330.2101 1349.2515 1349.6895 1363.1426 1366.3102 1377.0590 1377.5190 1379.4464 1390.8495 1394.6169 1413.6314 1416.8243 1430.2271 1447.3367 1459.8197 1463.0353 1466.9941 1467.6134 1473.6224 1482.7285 1484.1520 1486.4850 1499.6531 1579.3927 1640.0920 1662.1103 1674.3577 1695.2415 2941.1226 2963.5396 2964.0375 2976.6564 2978.9133 2979.8374 2983.3055 2990.2744 2996.0197 3002.5523 3007.7100 3033.6203 3037.6552 3039.5657 3064.3375 3066.1426 3066.8952 3069.8278 3081.4336 3088.1189 3095.0415 3097.5810 3097.7841 3104.9032 3105.1913 3235.3692 3351.5281 3563.8740
redmass: 4.2231 4.7783 3.3020 4.5802 5.2349 5.9628 5.5606 4.7991 4.8103 3.4995 3.0436 4.7394 3.3441 3.6638 2.4595 2.6737 2.3023 1.6448 2.1490 1.1149 2.6939 1.0862 3.1744 4.5724 2.9301 5.0657 3.7624 3.8471 3.7117 2.4044 2.3349 1.8812 2.2959 2.5131 4.9125 4.3429 4.0172 4.0020 3.0357 2.3400 1.6714 2.6411 3.3791 3.4135 2.5195 3.7004 5.0065 3.2248 3.6558 5.5212 3.3861 3.3513 4.5259 4.2818 2.9258 3.4852 2.3228 3.3471 2.9376 1.9950 2.5867 2.4338 1.8554 2.7131 3.8151 2.1467 1.2024 2.8096 2.6270 2.8011 1.5316 1.7957 1.4679 2.2424 2.2071 3.5374 3.2504 2.2082 2.2751 2.6640 2.2446 2.3706 1.9002 1.9879 2.1884 2.7453 2.6909 2.1069 1.5223 1.6583 1.3979 1.8189 1.6896 1.2336 1.6773 1.3758 1.3487 1.3301 1.3332 1.4293 1.6050 1.4847 1.4858 1.4778 1.4595 1.3991 1.3886 1.4578 1.2086 1.2263 1.3652 1.4190 1.2318 1.2220 1.1813 1.0855 1.0917 1.0643 1.0780 1.0427 1.0567 1.0683 1.0496 1.0525 1.0496 1.0582 8.5041 9.1068 6.2750 7.0102 11.8014 1.0810 1.0419 1.0790 1.0359 1.0577 1.0388 1.0597 1.0632 1.0838 1.0613 1.0588 1.0941 1.0825 1.0977 1.1019 1.0993 1.1010 1.0983 1.0980 1.0997 1.0990 1.0918 1.0993 1.0966 1.0632 1.1143 1.0637 1.0663
irintensity: 0.1448 0.7537 3.0670 1.4265 1.0043 2.4020 0.0861 2.1133 1.0569 1.0864 3.0691 0.2110 2.1882 0.5264 0.5791 0.1510 5.3055 85.1171 19.9159 0.1719 4.3171 0.0289 6.5413 4.6103 6.4562 1.2166 5.9232 3.7709 3.1821 21.5821 10.7586 1.7627 0.0392 5.0525 7.3391 7.5799 8.5808 35.6629 0.1737 38.4711 48.1921 16.6247 0.5630 10.2116 10.2243 15.7852 10.6108 7.1324 17.0215 19.0453 4.7634 9.9446 0.8179 15.5825 10.1685 0.6184 8.2978 1.4313 25.1311 35.5708 7.6553 47.1713 11.8927 40.1013 59.7320 18.3836 4.0038 33.4467 38.3995 13.2724 0.8130 16.4895 19.6935 124.8304 36.3862 27.7532 113.0252 109.2944 3.8937 19.6261 242.3549 18.8956 22.2060 14.2866 73.0307 11.1200 32.9607 62.0862 11.2335 21.2913 11.8847 5.6293 84.0552 1.5752 10.6664 30.6194 2.0519 3.4330 9.8520 5.3350 25.1621 44.3557 1.5756 7.6352 24.5468 53.7596 59.1890 8.7034 23.8761 16.5618 11.0855 9.5281 26.8897 42.6429 26.2088 18.0332 19.3578 12.5823 17.3618 1.2909 18.1417 6.5036 22.4766 6.3674 19.4737 17.3818 75.4937 114.6360 9.2037 40.1180 299.3778 5.1936 8.2406 29.4011 48.1088 13.9539 31.7706 30.8345 9.6309 30.6498 19.2527 17.8674 15.5919 14.4704 6.7229 14.1154 18.0033 5.5279 71.3073 18.3368 11.8553 45.7773 14.5968 10.2014 15.2948 4.7285 0.8067 49.9890 11.1224
temp: 298.150 k
press: 1.00000 atm
elementType: 8 8 8 8 8 8 8 6 6 6 6 6 6 6 6 6 6 6 6 6 6 6 6 6 6 6 6 1 1 1 1 1 1 1 1 1 1 1 1 1 1 1 1 1 1 1 1 1 1 1 1 1 1 1 1
symmnumber: 1
zpe: 1175052.6 jmol-1
zpe.correction: 0.447554 hartree
zpe.thermalcorrener: 0.476181 hartree
zpe.thermalcorrenthalpy: 0.477125 hartree
zpe.thermalcorrgfe: 0.389534 hartree
zpe.sumelectzpe: -1303.359515 hartree
zpe.sumelectthermal: -1303.330888 hartree
zpe.sumelectthermalent: -1303.329944 hartree
zpe.sumelectthermalfe: -1303.417535 hartree
dipole: 0.5867 4.8690 1.6011
dipole: 5.1589
quadrupole: -179.8226 -167.3316 -153.8375
quadrupole: -32.0292 -0.6985 5.6616
quadrupole: -12.8253 -0.3344 13.1597 -32.0292 -0.6985 5.6616
hfenergy: -1303.8070686 hartree
pointgroup: C01 [X(C20H28O7)]
dipole: 1.4983318 -1.3260876 0.3407577 debye
polarizability: 229.5229336|2.4122993|247.4659817|-13.0156921|6.4284055|220.8854177 unknown
InChI: InChI=1S/C20H28O7/c1-10(2)8-15(22)27-17-16-12(4)19(24)26-13(16)9-11(3)6-7-14(21)20(5,25)18(17)23/h6,10,13,16-18,23,25H,4,7-9H2,1-3,5H3
charge 0 multiplicity 1
55 atoms
O  0.653817 4.085147 -0.38052
O  -1.33575 -0.159374 0.705552
O  0.533761 0.098036 2.629982
O  0.482826 -2.474571 1.082112
O  -0.740414 5.283166 1.06138
O  1.893154 -2.654549 -1.082092
O  -1.48655 -1.475214 -1.216675
C  -0.188837 1.85576 -0.043201
C  -0.01143 0.347963 0.260509
C  1.086055 2.650332 -0.473571
C  1.074655 -0.07062 1.281886
C  1.604513 -1.541961 1.047348
C  1.668228 2.391135 -1.873662
C  -0.754635 2.791649 1.021692
C  -0.344025 4.184181 0.639853
C  2.33316 -1.739191 -0.328622
C  2.215019 0.958488 -1.954412
C  2.585731 -1.9361 2.182289
C  3.542997 -0.899946 -0.759841
C  3.123358 0.543776 -1.020974
C  -1.496778 2.539998 2.126908
C  -1.936328 -1.149796 -0.093335
C  1.626475 0.068662 -3.030088
C  -3.144544 -1.70945 0.633094
C  -4.058894 -2.655366 -0.186688
C  -4.67021 -1.951176 -1.421978
C  -3.342692 -3.97077 -0.578727
H  -0.888901 1.897371 -0.907846
H  0.210604 -0.158498 -0.694848
H  1.879149 2.527782 0.28918
H  1.946265 0.601095 1.147262
H  2.46075 3.140458 -2.060371
H  0.88337 2.553351 -2.634575
H  3.368591 -1.173229 2.354688
H  1.998261 -2.078017 3.105469
H  3.075783 -2.898801 1.957986
H  3.965286 -1.386785 -1.656752
H  4.316238 -0.920998 0.029703
H  3.536218 1.290027 -0.328059
H  1.278776 0.079819 3.282325
H  -1.765537 1.519832 2.408479
H  -1.813855 3.375888 2.762568
H  0.500776 -2.973427 0.211219
H  0.543412 -0.110801 -2.869781
H  2.110682 -0.918513 -3.091186
H  1.718194 0.567127 -4.014335
H  -2.741914 -2.236518 1.521747
H  -3.722813 -0.852152 1.028601
H  -4.893137 -2.92005 0.497161
H  -3.883979 -1.697468 -2.154346
H  -5.401793 -2.612472 -1.92159
H  -5.195526 -1.019483 -1.137446
H  -2.512523 -3.769795 -1.277273
H  -2.930883 -4.483583 0.311353
H  -4.049656 -4.663467 -1.071551
