program: Gaussian 09
title: 000158405
version: EM64L-G09RevD.01
frameworkgroup: C1[X(C17H19N3)]
method: RPBEPBE
basis: SDD
operation: Freq
keyword: #pfreq=noraman
keyword: PBEPBE/SDD
title: #p freq=noraman PBEPBE/SDD
converged: YES YES NO NO
title: Mulliken charges:
elementType: N N N C C C C C C C C C C C C C C C C C H H H H H H H H H H H H H H H H H H H
charge: -0.049317 -0.694172 -0.694171 0.457509 0.457510 -0.050424 -0.050423 0.381743 0.381744 -0.512586 -0.646598 -0.646599 0.364555 0.364553 -0.598894 -0.598892 -0.575922 -0.575922 -0.678421 -0.678422 0.251423 0.232319 0.232320 0.248161 0.248161 0.229802 0.195385 0.195384 0.229802 0.219146 0.216176 0.231486 0.231485 0.216175 0.219148 0.309185 0.314205 0.309184 0.314204
chargesum: 0.00000
title: Mulliken charges with hydrogens summed into heavy atoms:
elementType: N N N C C C C C C C C C C C C C C C C C
charge: -0.049317 -0.070783 -0.070783 0.457509 0.457510 -0.050424 -0.050423 0.381743 0.381744 -0.261163 -0.414278 -0.414280 0.364555 0.364553 -0.350733 -0.350731 -0.150735 -0.150736 -0.011615 -0.011614
polarizability: 4.72151226e+02 2.19121244e-04 1.97259885e+02 -7.99305878e-05 1.07768687e+01 1.06376188e+02
1716.lowfreq: -6.0522 -0.0007 0.0002 0.0003 3.0750 3.6292 40.9522 49.9438 85.4035
frequency: 40.9144 49.9313 85.4014 89.0359 106.3830 136.7404 150.3282 189.8150 193.6226 197.5266 202.4432 267.6091 284.1116 288.6304 302.0365 302.4177 320.9044 342.4283 352.6151 388.8058 392.8408 402.2512 410.2056 442.3750 461.7039 471.8482 485.1504 490.3598 527.2312 555.3430 580.5965 619.6031 684.8641 706.1472 722.0089 729.5222 739.9999 752.3263 753.9983 787.4445 795.1959 803.6329 831.3464 853.9132 869.6308 871.7167 873.7998 890.8446 934.1534 955.9030 959.8022 1041.0183 1048.2256 1050.7520 1051.3431 1064.3278 1065.2317 1140.7457 1165.9486 1192.6611 1199.4698 1219.7786 1236.0955 1244.2118 1257.9451 1287.5058 1289.1618 1298.3604 1307.1559 1313.3139 1344.4231 1362.4960 1388.7575 1388.9299 1406.0399 1416.8049 1464.1933 1470.0753 1470.8809 1479.4120 1483.1346 1496.3325 1497.0409 1498.8716 1507.8916 1511.7199 1545.1492 1589.1983 1625.9824 1637.2058 1642.4706 1661.3116 2960.2450 2960.3964 2980.9926 2981.1749 3032.3211 3032.3967 3076.1186 3076.2390 3085.2807 3085.3104 3102.5395 3102.7284 3108.2365 3138.5588 3139.2027 3570.2413 3570.6039 3711.7712 3711.7860
redmass: 4.1055 3.4911 3.0253 3.3895 4.1925 3.9177 2.4944 1.3481 2.3259 2.6149 1.4142 4.2318 4.1795 2.6247 1.3053 1.3702 2.4687 2.3119 3.2775 3.8709 1.3610 2.1651 1.5111 3.2069 2.8429 2.9016 3.2484 3.9480 3.2510 5.1923 3.4778 7.6796 7.7263 4.8012 5.6450 5.0862 4.3051 2.5791 2.7205 2.4057 1.2617 1.3572 4.4759 1.3442 1.8312 2.3666 1.8909 1.5322 1.6675 2.2159 2.1536 1.4979 1.4200 1.7606 1.9451 1.6529 1.6212 3.1483 1.7791 1.7999 2.0273 1.7504 1.3426 1.2888 2.0738 1.6408 2.9054 1.8341 1.4627 1.6711 4.2347 7.0314 1.2110 1.1962 3.4224 6.1269 3.3091 1.0581 1.0913 1.2044 1.1626 2.0913 1.3276 1.1609 4.9067 5.8765 6.1555 5.8012 3.9054 1.2536 1.3829 5.1444 1.0660 1.0660 1.0356 1.0356 1.0942 1.0942 1.0998 1.0998 1.1003 1.1003 1.0915 1.0909 1.0911 1.0911 1.0913 1.0449 1.0451 1.1034 1.1034
irintensity: 3.2090 0.0077 0.0016 1.2050 5.5316 0.1176 4.1872 0.0115 0.1002 0.6399 0.3876 0.1261 5.3883 0.0511 5.7564 277.1718 91.6640 0.5534 16.5651 1.0176 4.3129 40.6897 121.5380 7.0351 0.9278 2.2381 2.5581 4.7562 5.4038 9.5021 0.6779 2.2328 0.6405 0.0478 0.1915 0.9590 0.5460 0.0015 0.8073 0.4813 1.6411 3.3352 1.3561 19.7112 1.9272 9.0455 60.6878 0.3880 48.8994 7.4392 14.0327 3.4745 6.2111 65.3174 7.2745 3.3102 0.2360 2.2094 40.9921 0.0787 37.5059 30.6438 1.3547 20.0827 1.6274 3.8656 187.6184 6.9384 0.3021 0.4061 26.4234 10.5426 18.1454 6.2126 2.3202 20.3406 4.0040 27.4880 15.8353 44.1244 0.2932 311.7938 136.8498 32.6354 32.2825 13.6075 0.2159 42.3489 338.4053 69.2727 613.1936 56.5474 60.1840 57.6877 87.8663 33.5719 0.0112 19.1207 62.5525 61.3474 37.6814 29.5344 18.8229 14.6429 36.0965 15.7031 15.3851 201.2281 23.9531 16.6112 30.3881
temp: 298.150 k
press: 1.00000 atm
elementType: 7 7 7 6 6 6 6 6 6 6 6 6 6 6 6 6 6 6 6 6 1 1 1 1 1 1 1 1 1 1 1 1 1 1 1 1 1 1 1
symmnumber: 1
zpe: 845970.2 jmol-1
zpe.correction: 0.322213 hartree
zpe.thermalcorrener: 0.340988 hartree
zpe.thermalcorrenthalpy: 0.341933 hartree
zpe.thermalcorrgfe: 0.276595 hartree
zpe.sumelectzpe: -822.074069 hartree
zpe.sumelectthermal: -822.055294 hartree
zpe.sumelectthermalent: -822.054350 hartree
zpe.sumelectthermalfe: -822.119687 hartree
dipole: 0.0000 -0.8399 -0.1250
dipole: 0.8491
quadrupole: -68.0652 -106.5072 -126.5757
quadrupole: -0.0001 0.0006 2.5163
quadrupole: 32.3175 -6.1245 -26.1930 -0.0001 0.0006 2.5163
hfenergy: -822.3962821 hartree
pointgroup: C01 [X(C17H19N3)]
dipole: 0.0000001 -0.3267716 0.0694153 debye
polarizability: 472.1512255|0.0030536|195.5909733|0.0115996|-16.2798187|108.0451005 unknown
InChI: InChI=1S/C17H19N3/c1-3-10-5-12-7-13-6-11(4-2)15(19)9-17(13)20-16(12)8-14(10)18/h5-9H,3-4,18-19H2,1-2H3
charge 0 multiplicity 1
39 atoms
N  0.000028 1.515561 -0.209904
N  -4.842342 1.602346 -0.201762
N  4.8424 1.602425 -0.201463
C  -1.22598 -0.602363 0.263553
C  1.226044 -0.602342 0.263629
C  -1.178378 0.82515 -0.05516
C  1.178437 0.825173 -0.055081
C  -3.706611 -0.539178 0.252091
C  3.706674 -0.539112 0.252325
C  0.000034 -1.289749 0.418843
C  -2.509286 -1.230627 0.40784
C  2.509352 -1.230584 0.407994
C  -3.651167 0.886256 -0.059619
C  3.651225 0.886321 -0.059387
C  -2.412195 1.529416 -0.207328
C  2.412251 1.529461 -0.207169
C  -5.04303 -1.257562 0.375939
C  5.043102 -1.257466 0.376258
C  -5.707733 -1.559735 -0.997131
C  5.707911 -1.559594 -0.99677
H  0.000035 -2.360836 0.661102
H  -2.541448 -2.301497 0.650614
H  2.541519 -2.301454 0.650766
H  -2.353822 2.598348 -0.440464
H  2.353875 2.598393 -0.440304
H  -4.88814 -2.213701 0.909083
H  -5.745578 -0.673946 1.007818
H  5.745591 -0.673841 1.008195
H  4.888198 -2.213617 0.909377
H  -5.862946 -0.640486 -1.590868
H  -6.687962 -2.053238 -0.861767
H  -5.064139 -2.229709 -1.59417
H  5.064379 -2.229575 -1.593868
H  6.688145 -2.053072 -0.861343
H  5.863143 -0.640328 -1.590476
H  -4.815905 2.600229 -0.390207
H  -5.746303 1.159361 -0.078247
H  4.815963 2.60031 -0.389896
H  5.746358 1.159461 -0.07784
