program: Gaussian 09
title: 000158379
version: EM64L-G09RevD.01
frameworkgroup: C1[X(C11H14N4O5)]
method: RPBEPBE
basis: SDD
operation: Freq
keyword: #p
keyword: freq=noraman
keyword: PBEPBE/SDD
title: #p freq=noraman PBEPBE/SDD
converged: YES YES NO NO
title: Mulliken charges:
elementType: O O O O O N N N N C C C C C C C C C C C H H H H H H H H H H H H H H
charge: -0.311514 -0.484246 -0.448506 -0.445873 -0.394986 -0.186113 -0.412287 -0.050005 -0.651444 -0.094927 -0.189078 -0.130264 -0.112134 -0.314224 0.149284 -0.159401 0.178280 -0.410210 0.244469 0.100398 0.283952 0.237557 0.225023 0.287857 0.191712 0.233991 0.267776 0.392927 0.379311 0.251731 0.354848 0.353150 0.329706 0.333240
chargesum: 0.00000
title: Mulliken charges with hydrogens summed into heavy atoms:
elementType: O O O O O N N N N C C C C C C C C C C C
charge: -0.311514 -0.091319 -0.069195 -0.091025 -0.394986 -0.186113 -0.059137 -0.050005 0.011502 0.189025 0.048480 0.094759 0.175722 0.111479 0.149284 0.108374 0.178280 -0.158479 0.244469 0.100398
polarizability: 2.20908627e+02 6.55982699e+00 1.81007472e+02 5.22554670e+00 4.78914872e+00 9.02358079e+01
1716.lowfreq: -0.0005 -0.0003 -0.0003 5.3082 8.0324 9.8804 32.8014 43.1926 52.8518
frequency: 32.6431 43.1707 52.8015 76.6840 119.3587 132.2615 156.5104 169.2926 185.7572 202.4265 255.4152 262.1857 282.8064 300.6229 321.2229 325.8379 369.3626 374.4813 387.8639 395.0429 421.8433 479.1182 481.3700 503.2547 556.3491 582.0916 587.6879 590.3915 594.2556 602.1715 635.6116 656.2691 672.2560 712.1254 735.5126 738.9020 777.8474 779.8020 797.4752 826.6742 863.6638 871.8258 886.8855 950.3560 960.6802 977.6117 986.3855 1015.1271 1019.4764 1038.4505 1042.9695 1068.1815 1082.8748 1090.3936 1120.5387 1170.2547 1176.4923 1188.9862 1206.1340 1238.3461 1259.3286 1265.5567 1269.0780 1270.8472 1287.4395 1315.6639 1321.9923 1340.0998 1346.2644 1376.7414 1387.0482 1391.3604 1410.8871 1423.7839 1441.7922 1465.8694 1473.4215 1474.8634 1535.6865 1553.5295 1613.1338 1635.3838 2907.9157 2942.5763 2969.7041 2989.6847 3037.0853 3064.6818 3083.1967 3217.5937 3260.2500 3363.4994 3526.3259 3549.0572 3569.3775 3722.3962
redmass: 6.7571 6.2131 6.8778 7.8997 4.5019 4.4068 4.7849 6.0973 6.1283 4.7751 5.3072 4.8003 1.5362 4.5394 4.9246 4.9793 5.2720 3.5746 4.8545 4.7917 1.1167 1.2079 7.7235 3.2577 4.8229 6.5026 3.9919 3.2367 1.6023 2.7247 7.0812 3.5311 5.8163 4.6469 1.5673 2.0479 5.0093 2.2568 5.2525 3.8150 2.0436 1.3876 1.4139 3.7508 3.3079 2.8785 2.7025 3.3281 3.9525 2.0647 3.7004 4.6934 3.0147 2.4071 2.3527 1.9814 1.1583 1.3878 2.1526 1.3040 1.9755 1.9207 1.9809 1.4545 1.3311 1.1724 1.5963 1.2201 1.8763 1.7409 1.3359 1.5929 2.3156 4.4344 6.5631 2.1716 1.8906 1.1601 3.6593 5.8424 1.7897 2.4949 1.0737 1.0700 1.0840 1.0865 1.0865 1.0909 1.0901 1.0946 1.1022 1.0637 1.0656 1.0785 1.0455 1.1042
irintensity: 0.7774 1.0834 3.1643 2.4873 1.5884 1.0149 6.5402 13.6339 5.8176 0.9321 5.4744 14.1518 97.3977 1.7988 6.2179 8.4912 5.0436 66.6353 28.0823 9.1147 143.1362 104.4520 16.2511 11.9942 13.7346 8.8935 26.9524 54.5716 56.2314 30.9860 12.9534 5.6748 16.3603 9.6983 85.1179 68.8976 10.2880 47.4085 34.8576 25.4160 24.9458 10.0583 87.9616 113.0732 21.8736 21.4713 40.5667 30.3135 113.8655 37.7091 68.8051 15.7088 19.9626 9.6345 6.7695 10.9699 49.8706 91.3167 70.1195 35.6555 33.6385 9.0242 36.2377 9.6204 10.9357 20.0632 1.1814 92.5024 48.4024 106.3366 11.1842 63.2451 19.7534 200.6957 13.9534 53.8341 221.2559 41.5917 128.6306 98.0939 408.8710 25.1454 1194.5303 50.4475 56.2256 82.6865 9.1181 18.9220 28.0182 1.5983 5.1859 62.8765 6.8848 86.0023 103.3843 37.3418
temp: 298.150 k
press: 1.00000 atm
elementType: 8 8 8 8 8 7 7 7 7 6 6 6 6 6 6 6 6 6 6 6 1 1 1 1 1 1 1 1 1 1 1 1 1 1
symmnumber: 1
zpe: 683040.8 jmol-1
zpe.correction: 0.260157 hartree
zpe.thermalcorrener: 0.277843 hartree
zpe.thermalcorrenthalpy: 0.278787 hartree
zpe.thermalcorrgfe: 0.214537 hartree
zpe.sumelectzpe: -1021.183904 hartree
zpe.sumelectthermal: -1021.166217 hartree
zpe.sumelectthermalent: -1021.165273 hartree
zpe.sumelectthermalfe: -1021.229523 hartree
dipole: 5.3320 3.5807 1.4114
dipole: 6.5760
quadrupole: -113.9337 -122.2497 -118.2559
quadrupole: 9.9924 -2.6805 0.6284
quadrupole: 4.2128 -4.1033 -0.1095 9.9924 -2.6805 0.6284
hfenergy: -1021.4440602 hartree
pointgroup: C01 [X(C11H14N4O5)]
dipole: -2.0417255 -1.4415612 0.668446 debye
polarizability: 219.9703482|7.0211432|181.0642618|-10.5123383|-7.0774463|91.1172971 unknown
InChI: InChI=1S/C11H14N4O5/c12-9-4-1-2-15(6(4)10(19)14-13-9)11-8(18)7(17)5(3-16)20-11/h1-2,5,7-8,11,14,16-18H,3,12H2
charge 0 multiplicity 1
34 atoms
O  2.269184 -0.604387 -1.106076
O  1.521359 2.556154 0.416259
O  3.898834 1.994931 -0.417047
O  3.610552 -2.865854 -0.083968
O  -0.973532 2.50508 -0.305719
N  0.00862 -0.470174 -0.326543
N  -3.068165 1.555093 0.072892
N  -4.022114 0.562486 0.299558
N  -4.484542 -1.704614 0.58252
C  1.229155 0.317581 -0.678229
C  1.791815 1.143645 0.52857
C  3.337677 0.952474 0.424042
C  3.509421 -0.406889 -0.264389
C  3.622597 -1.612819 0.677845
C  -1.2652 0.063085 -0.128692
C  -0.068823 -1.856391 -0.186121
C  -2.159722 -1.011256 0.129058
C  -1.391484 -2.222877 0.095893
C  -1.695282 1.443081 -0.13972
C  -3.559537 -0.705774 0.339186
H  0.967821 0.990737 -1.514949
H  1.406597 0.720285 1.478762
H  3.805838 0.970391 1.42959
H  4.348494 -0.381684 -0.978576
H  2.79519 -1.601651 1.421072
H  4.584418 -1.591186 1.218465
H  0.813813 -2.475602 -0.315888
H  0.539519 2.683301 0.142193
H  3.253312 2.759996 -0.343781
H  -1.737078 -3.243611 0.249316
H  3.008398 -2.733732 -0.862875
H  -3.457144 2.500939 0.073875
H  -4.211159 -2.68101 0.601729
H  -5.459434 -1.449748 0.719947
