program: Gaussian 09
title: 000158370
version: EM64L-G09RevD.01
frameworkgroup: C1[X(C20H18O7)]
method: RPBEPBE
basis: SDD
operation: Freq
keyword: #pfreq=noraman
keyword: PBEPBE/SDD
title: #p freq=noraman PBEPBE/SDD
converged: YES YES NO NO
title: Mulliken charges:
elementType: O O O O O O O C C C C C C C C C C C C C C C C C C C C H H H H H H H H H H H H H H H H H H
charge: -0.244156 -0.439583 -0.220552 -0.263166 -0.264480 -0.264310 -0.251301 -0.172738 -0.255243 -0.214519 -0.369327 -0.429696 0.545675 0.094533 0.356881 -0.470344 -0.477782 0.191384 -0.330877 0.156886 -0.499403 -0.358475 0.174349 -0.332084 0.162450 -0.205460 -0.205901 0.268817 0.259926 0.207668 0.255796 0.187934 0.234386 0.212795 0.314548 0.229595 0.352496 0.248431 0.316525 0.285496 0.258080 0.231846 0.238705 0.239407 0.244785
chargesum: 0.00000
title: Mulliken charges with hydrogens summed into heavy atoms:
elementType: O O O O O O O C C C C C C C C C C C C C C C C C C C C
charge: -0.244156 -0.087087 -0.220552 -0.263166 -0.264480 -0.264310 -0.251301 0.096080 0.004683 -0.006850 0.074403 0.017486 0.545675 0.094533 0.356881 -0.155795 -0.248186 0.191384 -0.082446 0.156886 -0.182878 -0.072979 0.174349 -0.074004 0.162450 0.265091 0.278290
polarizability: 2.82249654e+02 -1.12138889e+00 2.44814212e+02 -1.89443828e+01 -1.34470453e+01 1.93978847e+02
1716.lowfreq: -8.5791 -1.7498 0.0003 0.0006 0.0008 4.6482 8.4321 22.1112 31.4390
frequency: 8.3235 22.0748 31.4033 44.3999 51.5828 71.6703 82.7103 84.8478 113.5400 119.5329 131.5691 157.2111 167.7706 185.1157 206.8876 222.6138 239.3089 275.0678 281.3494 295.6397 312.8245 327.3099 337.7254 369.1711 382.9572 421.8136 423.0345 434.7440 448.7782 469.2638 541.2551 556.2391 565.5454 595.8539 611.5187 631.5980 669.7429 675.3172 682.7390 690.7080 700.3919 726.0078 738.3637 766.2918 778.8240 787.6303 787.9411 809.2258 826.6427 837.9271 840.0787 854.6635 876.5316 892.7333 909.0897 913.3064 927.2780 933.5426 942.7055 966.7448 972.5886 975.6586 976.8649 981.9264 998.2037 1027.8982 1050.6770 1055.2778 1059.3539 1069.1627 1069.9326 1071.7783 1085.1412 1126.5493 1126.7966 1129.0534 1137.6080 1145.7961 1175.2199 1190.1545 1204.2013 1213.5506 1234.8321 1245.7733 1253.3194 1262.7930 1276.6114 1277.6764 1310.7594 1326.8513 1336.1768 1347.0862 1354.9420 1361.5299 1363.8720 1372.5748 1383.5395 1410.6625 1441.5617 1443.2885 1460.2767 1465.2459 1475.3448 1476.1040 1484.9031 1487.3915 1560.8961 1599.6822 1611.5280 1623.6650 1628.5765 2919.7124 2955.7015 2970.6251 2996.7477 3008.9298 3021.7485 3029.0217 3067.4989 3095.3291 3106.6166 3112.4858 3128.6999 3146.2559 3162.0751 3169.6354 3179.6606 3185.3439 3565.8273
redmass: 7.4124 5.7483 5.5500 5.9162 5.5836 6.2472 2.7782 2.6777 5.9845 5.9917 4.5573 6.5880 4.5006 5.2389 4.6863 5.2615 5.9515 3.7350 5.2024 5.8910 6.1897 5.0530 1.3880 3.4828 6.4432 3.5893 4.5930 2.9175 4.3817 4.9536 6.4322 5.3921 6.9116 7.2227 4.6368 4.0483 6.1834 7.9442 6.8302 6.9004 5.7863 4.3922 4.9587 6.5347 6.4494 5.3233 4.1852 1.4325 3.6074 7.6789 2.0820 3.5758 2.8014 3.8617 3.9882 1.5149 1.4045 1.8529 2.0280 4.5584 3.1062 1.4284 4.7890 3.5260 3.6460 2.4623 2.8912 3.1199 3.5926 2.2999 1.6478 1.5026 2.6539 1.0558 1.2105 1.2188 1.2942 1.2829 1.2431 1.5559 1.2622 1.8862 1.3520 3.4919 4.7154 1.3667 1.2388 1.2627 1.3929 1.6129 1.3908 1.3777 1.5717 1.3551 1.2773 1.2483 3.8813 2.9152 4.6968 4.7601 1.0905 1.0960 2.0933 1.6847 1.3945 1.5882 8.9099 7.3773 7.7346 8.4609 8.1917 1.0836 1.0695 1.0657 1.0611 1.0593 1.0857 1.0841 1.0993 1.0950 1.1100 1.1124 1.0897 1.0945 1.0892 1.0942 1.0953 1.0966 1.0664
irintensity: 0.1940 0.5631 0.9851 1.4505 0.4170 0.3338 15.3000 7.3182 12.4753 1.9656 3.3082 2.1614 1.3683 11.1654 8.4667 1.0317 1.7359 1.4752 8.4996 2.8653 2.5444 7.3695 133.0346 71.5438 7.9054 6.6573 2.2312 16.6619 2.5947 13.9592 9.6260 0.9146 10.7419 3.5492 0.6883 19.4280 5.9187 0.6627 1.6280 4.3438 13.5814 3.9277 8.6789 24.7280 17.0635 5.1339 13.1008 52.4035 28.3350 23.1333 38.6135 10.8030 1.5386 28.1346 6.3540 25.5022 3.7993 11.9372 71.8892 57.1514 203.8087 18.5896 57.2645 47.9155 51.3735 33.4302 28.5295 35.1136 9.4490 55.4922 20.3943 8.2603 11.0717 2.7143 1.1460 2.4990 5.3503 23.3792 3.0756 20.4530 19.7238 45.6966 23.6953 182.9812 485.0994 31.1397 7.4805 3.3754 63.1800 39.6553 22.7758 25.5493 14.9081 9.7542 2.6614 22.8837 12.4702 10.1936 71.1650 57.1487 12.4395 9.8793 95.8060 58.2189 40.8847 62.1179 170.8535 9.9908 3.5904 23.7539 0.2312 38.7872 99.2133 73.4782 136.6692 124.7519 8.1386 14.9862 28.4511 8.0229 29.6152 25.7248 11.7815 29.3305 0.4223 10.3769 8.6066 6.3518 9.2497
temp: 298.150 k
press: 1.00000 atm
elementType: 8 8 8 8 8 8 8 6 6 6 6 6 6 6 6 6 6 6 6 6 6 6 6 6 6 6 6 1 1 1 1 1 1 1 1 1 1 1 1 1 1 1 1 1 1
symmnumber: 1
zpe: 898990.4 jmol-1
zpe.correction: 0.342407 hartree
zpe.thermalcorrener: 0.365689 hartree
zpe.thermalcorrenthalpy: 0.366633 hartree
zpe.thermalcorrgfe: 0.286461 hartree
zpe.sumelectzpe: -1297.464495 hartree
zpe.sumelectthermal: -1297.441213 hartree
zpe.sumelectthermalent: -1297.440269 hartree
zpe.sumelectthermalfe: -1297.520442 hartree
dipole: 2.9092 -0.4351 -3.5075
dipole: 4.5777
quadrupole: -141.0168 -148.4049 -157.8519
quadrupole: -0.4053 0.7119 -2.9762
quadrupole: 8.0744 0.6863 -8.7607 -0.4053 0.7119 -2.9762
hfenergy: -1297.8069024 hartree
pointgroup: C01 [X(C20H18O7)]
dipole: 1.2561502 0.4592577 1.2061241 debye
polarizability: 284.8800458|4.0823493|238.9602168|10.6428045|-21.2284855|197.2024503 unknown
InChI: InChI=1S/C20H18O7/c21-7-13-14(19(22)11-1-3-15-17(5-11)26-9-24-15)8-23-20(13)12-2-4-16-18(6-12)27-10-25-16/h1-6,13-14,20-21H,7-10H2
charge 0 multiplicity 1
45 atoms
O  -1.729703 -2.658815 -0.890784
O  2.004508 -2.428545 2.019335
O  -0.031777 -0.435695 -2.426445
O  -3.886905 2.134525 -0.758192
O  -5.030702 2.283203 1.344478
O  5.079449 0.544195 0.874928
O  5.2181 2.614205 -0.32858
C  -0.041642 -1.829832 0.680384
C  0.604377 -2.076736 -0.732979
C  -1.569465 -2.187695 0.498575
C  -0.402512 -3.029705 -1.409494
C  0.584538 -2.730149 1.767425
C  -2.528513 -1.035679 0.751249
C  0.792041 -0.764909 -1.519169
C  1.955968 0.124405 -1.193816
C  -2.702322 -0.034698 -0.25093
C  -3.213961 -0.948132 1.986659
C  -3.567318 1.013763 0.054283
C  -4.08583 0.136422 2.285564
C  -4.242256 1.104564 1.292906
C  2.955791 -0.242062 -0.23452
C  2.048406 1.364132 -1.888653
C  3.997056 0.660624 -0.03846
C  3.111833 2.270496 -1.670922
C  4.081679 1.886562 -0.737189
C  -4.975386 2.838738 -0.035725
C  5.969336 1.692951 0.574479
H  0.064929 -0.772896 0.986424
H  1.587812 -2.563065 -0.599154
H  -1.821874 -3.024109 1.188996
H  -0.450844 -2.905227 -2.502336
H  -0.169688 -4.085489 -1.154916
H  0.57946 -3.78607 1.444644
H  -0.000889 -2.650631 2.707494
H  -2.198672 -0.117571 -1.218312
H  -3.087481 -1.743327 2.730855
H  2.071919 -1.590093 2.542402
H  -4.617726 0.204347 3.237738
H  2.908973 -1.179815 0.327539
H  1.261027 1.596453 -2.612099
H  3.179117 3.221892 -2.203792
H  -5.937997 2.635364 -0.542655
H  -4.73522 3.911569 0.019887
H  6.867843 1.331279 0.04136
H  6.20382 2.224057 1.509517
