program: Gaussian 09
title: 000158349
version: EM64L-G09RevD.01
frameworkgroup: C1[X(C20H21N3O5)]
method: RPBEPBE
basis: SDD
operation: Freq
keyword: #p
keyword: freq=noraman
keyword: PBEPBE/SDD
title: #p freq=noraman PBEPBE/SDD
converged: YES YES NO NO
title: Mulliken charges:
elementType: O O O O O N N N C C C C C C C C C C C C C C C C C C C C H H H H H H H H H H H H H H H H H H H H H
charge: -0.254900 -0.307689 -0.255701 -0.199330 -0.202017 -0.154329 -0.201692 -0.390952 0.491854 -0.395547 -0.398333 0.415395 0.180045 -0.523165 -0.395561 -0.340524 -0.426523 -0.392513 -0.354532 0.022888 -0.657961 -0.657822 0.186026 0.105778 0.186940 0.207156 -0.251457 -0.243296 0.228871 0.229700 0.227941 0.235447 0.270039 0.235217 0.241459 0.234812 0.276970 0.222347 0.243965 0.297933 0.221778 0.239258 0.221145 0.223647 0.246279 0.217213 0.357869 0.267915 0.267959
chargesum: 0.00000
title: Mulliken charges with hydrogens summed into heavy atoms:
elementType: O O O O O N N N C C C C C C C C C C C C C C C C C C C C
charge: -0.254900 -0.307689 -0.255701 -0.199330 -0.202017 -0.154329 -0.201692 -0.033083 0.491854 0.063024 0.065055 0.415395 0.180045 -0.253127 -0.160344 0.135747 -0.182559 0.106803 -0.056599 0.022888 0.024220 0.029317 0.186026 0.105778 0.186940 0.207156 0.016458 0.024663
polarizability: 4.57521025e+02 3.50585585e+01 2.47812083e+02 -5.30307679e+01 1.26665069e+01 1.73799317e+02
1716.lowfreq: -9.8588 -4.5907 -0.0008 -0.0004 0.0004 4.1319 11.2993 18.2840 21.2811
frequency: 10.5991 18.1207 21.1721 32.4626 46.9725 60.8302 63.4503 76.9341 88.7689 99.4090 105.7893 123.5597 136.1546 158.3941 177.3523 202.1186 212.5972 223.8617 226.9415 244.4028 253.0471 291.3413 292.4042 308.0999 315.6900 328.4932 343.9235 367.7583 385.4326 396.2573 414.1698 434.8052 455.9085 464.8979 502.4426 521.6260 532.2699 552.2466 572.5080 586.9148 618.0496 626.1501 634.1979 665.1377 672.3673 689.4609 692.7232 734.5370 736.3554 737.8125 754.6292 756.8541 785.9671 788.0168 789.5209 803.1279 817.2723 824.5587 846.3771 857.9388 878.0782 900.1304 924.2391 936.1592 937.8564 945.1997 960.0985 976.4974 986.3388 1016.9941 1032.4093 1051.4940 1074.6731 1076.1874 1084.5028 1094.7002 1120.6317 1133.0573 1134.1598 1150.5269 1162.9396 1194.0116 1197.2677 1226.2571 1262.5111 1270.1151 1278.8631 1282.6857 1291.2565 1302.1480 1309.1863 1339.8518 1347.6538 1354.3045 1354.9779 1362.8572 1374.8804 1379.4209 1389.4403 1392.8053 1418.2208 1443.8303 1449.3351 1463.8848 1467.2352 1469.4074 1479.2984 1482.8654 1495.9793 1505.6939 1519.6966 1527.6405 1537.5364 1564.4830 1582.4831 1594.5164 1622.2591 1633.3805 1660.7163 1678.1384 2986.8391 2987.5037 2999.5680 3005.1053 3008.0305 3016.7861 3048.4776 3053.6492 3076.5122 3084.2472 3084.4791 3089.6412 3094.2109 3096.2930 3136.2491 3137.8019 3177.4494 3187.1780 3203.9020 3233.2274 3369.0745
redmass: 5.8708 6.8090 6.8590 6.2448 4.3947 5.1844 5.4545 3.6366 3.6890 5.6220 4.3956 6.8958 4.9607 3.9431 3.9879 2.2614 1.0755 4.6741 1.6728 3.4821 4.8312 4.2311 3.9038 3.8873 3.1687 4.0485 5.2239 5.1891 7.5217 3.9448 4.0658 3.5038 3.8333 4.3093 2.7604 2.8690 3.5706 4.1864 5.7234 6.2499 7.2419 2.2780 4.1807 7.2143 4.6052 6.7463 4.9564 6.9731 3.2354 5.8190 3.4762 3.0970 1.4943 1.1857 1.2712 1.5315 2.1111 3.6986 1.7148 2.7717 3.0435 4.6651 2.1855 3.4851 1.3290 1.3221 3.0176 2.4545 1.4269 2.6825 1.5734 3.0811 2.2065 1.8300 3.0007 1.7028 2.4869 2.4356 2.5832 2.7669 1.9636 1.5447 2.6993 2.1590 1.5104 1.2298 1.2828 1.7320 1.3728 1.8979 1.7299 1.2725 1.3988 1.8406 1.9512 1.2300 2.8990 3.1486 1.2105 1.3156 3.2077 1.1053 1.1408 2.7004 1.0798 1.0746 1.1369 1.0612 1.1129 1.4657 2.6080 2.4950 3.1949 8.5831 6.9616 6.7012 10.6308 5.5959 7.5525 10.5989 1.0356 1.0358 1.0607 1.0611 1.0602 1.0609 1.1025 1.1022 1.1044 1.1001 1.0996 1.1030 1.1014 1.1010 1.0915 1.0902 1.0935 1.0913 1.0893 1.1107 1.0817
irintensity: 0.2940 0.4989 0.1980 0.5406 0.1059 0.7506 1.8956 2.2494 0.6239 4.5304 5.2933 1.2039 7.1841 6.6225 2.5840 2.7377 0.0566 4.9321 0.3793 3.5037 0.6912 1.2786 17.7732 13.3185 6.5103 6.5088 13.7983 11.3617 1.4909 4.9104 3.7041 6.9284 6.9654 9.5881 6.9726 9.1007 4.7979 0.3535 0.3876 1.0004 5.1565 0.9029 5.0955 1.8850 12.0342 22.0091 13.9044 2.3134 0.2939 6.4677 5.4639 1.2940 99.0368 16.1513 16.3150 38.4208 86.3891 10.3275 46.2303 33.5982 2.5432 26.0302 3.5568 15.0567 0.0501 0.7238 3.4197 4.8331 12.1884 38.2593 15.2479 1.8815 12.5466 38.9591 23.1350 17.2612 158.4861 2.4098 6.0813 17.9870 1.6502 40.3631 44.1009 252.9481 39.1825 14.3599 22.4706 0.0987 6.1755 0.9733 52.7860 13.2453 165.6937 40.7533 5.6557 18.8261 107.4083 18.1706 4.0255 37.1162 152.6781 30.7735 45.8055 45.4063 18.2115 2.2101 2.7696 5.2094 38.1889 41.8115 149.9756 827.2595 422.8682 237.7981 7.2772 3.9729 555.5479 754.0417 246.4120 5.1428 28.6983 25.9594 44.5180 59.2598 7.1528 78.3777 4.2030 7.1891 9.6418 16.5791 63.8656 6.1155 19.3538 69.2493 2.8514 2.4334 16.3041 4.8188 0.1421 1.7785 169.1009
temp: 298.150 k
press: 1.00000 atm
elementType: 8 8 8 8 8 7 7 7 6 6 6 6 6 6 6 6 6 6 6 6 6 6 6 6 6 6 6 6 1 1 1 1 1 1 1 1 1 1 1 1 1 1 1 1 1 1 1 1 1
symmnumber: 1
zpe: 1002718.1 jmol-1
zpe.correction: 0.381915 hartree
zpe.thermalcorrener: 0.408187 hartree
zpe.thermalcorrenthalpy: 0.409131 hartree
zpe.thermalcorrgfe: 0.322020 hartree
zpe.sumelectzpe: -1313.106262 hartree
zpe.sumelectthermal: -1313.079990 hartree
zpe.sumelectthermalent: -1313.079046 hartree
zpe.sumelectthermalfe: -1313.166157 hartree
dipole: -9.6916 -2.8363 1.2082
dipole: 10.1702
quadrupole: -117.8251 -157.5416 -172.7123
quadrupole: 10.7488 3.3850 -9.4594
quadrupole: 31.5346 -8.1819 -23.3527 10.7488 3.3850 -9.4594
hfenergy: -1313.4881769 hartree
pointgroup: C01 [X(C20H21N3O5)]
dipole: 3.7959775 1.2592545 -0.12192 debye
polarizability: 457.3186156|56.5800461|225.7910164|28.3312619|-37.3588765|196.0227924 unknown
InChI: InChI=1S/C20H21N3O5/c1-3-22(4-2)14-6-5-13-11-15(20(27)28-16(13)12-14)19(26)21-9-10-23-17(24)7-8-18(23)25/h5-8,11-12,21H,3-4,9-10H2,1-2H3
charge 0 multiplicity 1
49 atoms
O  1.374924 -1.659524 0.684698
O  -2.669357 0.194419 -1.358505
O  -0.603627 -2.746859 1.048009
O  -3.75301 0.624001 2.631903
O  -6.352251 0.682776 -1.278459
N  5.707659 0.420113 0.105197
N  -5.095911 0.268295 0.69652
N  -2.899287 -1.744689 -0.074381
C  4.339571 0.403407 -0.138227
C  6.573256 1.531945 -0.34925
C  6.380244 -0.676059 0.839118
C  1.498546 0.385913 -0.666114
C  2.132431 -0.6216 0.127834
C  3.504422 -0.627135 0.398315
C  3.712973 1.426813 -0.946096
C  -5.226149 -1.190863 0.736545
C  2.341297 1.41112 -1.191932
C  -4.335043 -1.888247 -0.325663
C  0.089711 0.298064 -0.875357
C  -0.679608 -0.728286 -0.331866
C  7.105478 1.348842 -1.789229
C  6.366225 -0.487582 2.373601
C  -2.158884 -0.720169 -0.625232
C  -0.053252 -1.763491 0.487687
C  -4.339456 1.050914 1.605755
C  -5.620888 1.084054 -0.340154
C  -4.413339 2.468527 1.094937
C  -5.156125 2.486715 -0.04443
H  6.027095 2.487898 -0.256868
H  7.424514 1.597054 0.353453
H  7.425543 -0.72333 0.481295
H  5.917134 -1.640694 0.5638
H  3.892787 -1.424461 1.034323
H  4.316535 2.22206 -1.389494
H  -4.949041 -1.516776 1.754434
H  -6.281779 -1.458025 0.544813
H  -4.563043 -1.464314 -1.318583
H  -4.588112 -2.964444 -0.33725
H  1.892343 2.196364 -1.810834
H  -0.440552 1.043813 -1.480033
H  7.766354 2.191016 -2.065088
H  6.279073 1.302317 -2.519343
H  7.687598 0.413962 -1.877791
H  6.891165 -1.325435 2.867701
H  5.33472 -0.447995 2.763557
H  6.873682 0.451269 2.660024
H  -2.394262 -2.419865 0.520491
H  -3.917123 3.289857 1.612053
H  -5.41518 3.326411 -0.68919
