program: Gaussian 09
title: 000158346
version: EM64L-G09RevD.01
frameworkgroup: C1[X(C17H14N2O)]
method: RPBEPBE
basis: SDD
operation: Freq
keyword: #p
keyword: freq=noraman
keyword: PBEPBE/SDD
title: #p freq=noraman PBEPBE/SDD
converged: YES YES NO NO
title: Mulliken charges:
elementType: O N N C C C C C C C C C C C C C C C C C H H H H H H H H H H H H H H
charge: -0.436304 -0.475328 0.012490 0.069687 -0.035347 0.074298 0.152861 0.210461 0.170373 0.395609 0.212748 -0.506265 -0.354544 -0.833855 -0.383860 -0.338889 -0.532687 -0.296007 -0.206302 -0.386849 0.304051 0.206337 0.229547 0.261108 0.247618 0.247155 0.210246 0.236400 0.240503 0.258225 0.229262 0.228160 0.239413 0.349685
chargesum: 0.00000
title: Mulliken charges with hydrogens summed into heavy atoms:
elementType: O N N C C C C C C C C C C C C C C C C C
charge: -0.086620 -0.171276 0.012490 0.069687 -0.035347 0.074298 0.152861 0.210461 0.170373 0.395609 0.212748 -0.070381 -0.093436 -0.128835 -0.147460 -0.098385 -0.274462 -0.066744 0.021857 -0.147436
polarizability: 3.61932353e+02 -6.98134412e-01 2.16433588e+02 -5.52359781e-01 6.45700071e+00 8.94128554e+01
1716.lowfreq: -5.5766 -0.0007 -0.0007 -0.0002 3.1777 7.7275 39.3412 60.2501 77.9579
frequency: 39.3261 60.1723 77.9310 88.9663 95.2394 138.1118 159.2602 179.5046 226.9583 251.0458 276.8092 288.8948 314.5074 335.3247 348.1957 371.3161 401.4550 423.7382 460.6146 480.0926 489.2175 505.1731 558.7190 568.5993 588.2581 597.8935 625.4692 643.2428 672.4404 699.2094 729.2619 757.3067 768.2523 777.2307 815.9024 832.8647 835.8588 857.8791 866.0252 910.0614 924.0281 929.8433 939.3026 964.1238 977.2788 1007.1188 1011.0485 1026.6296 1032.0531 1058.4385 1071.9606 1111.5696 1118.6130 1160.5440 1175.2933 1181.9573 1220.8938 1252.7959 1260.9705 1284.4905 1294.1783 1315.8915 1341.9967 1351.3633 1371.5708 1376.1824 1400.5627 1403.1537 1417.8178 1424.9847 1445.9192 1466.6283 1466.8553 1473.8751 1481.0892 1483.7121 1507.4340 1569.0017 1587.7938 1592.2634 1625.3611 1637.3622 2976.5916 2976.9952 3051.7624 3077.8197 3107.7221 3130.9718 3135.1927 3137.0979 3141.8417 3153.9335 3162.5357 3169.3369 3549.7322 3617.8104
redmass: 4.4575 2.6934 1.5113 4.3919 4.4554 2.8254 4.5212 5.1510 3.2638 1.2886 3.1428 4.4272 4.8217 2.8758 4.1648 4.9560 4.5732 3.4697 3.0177 5.7438 1.2978 3.6911 4.5498 4.5866 3.9461 5.7361 4.7456 5.8977 6.4505 5.2989 3.4684 1.5130 4.0701 4.0722 4.1998 1.6170 3.3498 1.4704 3.6928 2.5755 2.5950 3.0087 1.4083 1.4194 1.3120 2.2725 4.2582 2.0999 1.5250 2.3819 2.4362 2.1937 2.3815 1.6464 1.2829 1.3913 1.6992 1.5146 2.2798 1.3882 2.5240 2.1457 3.0212 3.5949 1.3727 1.5588 3.3412 1.3385 4.8956 3.6075 2.7241 1.1763 2.5548 2.3068 1.9936 1.6134 1.1310 7.9295 6.3299 7.1826 6.4818 7.9747 1.0461 1.0632 1.0979 1.0971 1.0916 1.0858 1.0863 1.0901 1.0894 1.0949 1.0976 1.1000 1.0665 1.0796
irintensity: 0.8456 0.8726 1.4913 0.7560 3.9981 0.2714 0.8127 1.4262 6.3546 83.2187 0.3950 9.0320 2.5264 13.3309 6.0347 1.1530 0.0742 0.3307 1.8488 2.5411 100.5285 7.4656 1.0305 0.5871 2.6724 8.7809 1.2945 1.1375 0.5722 4.5473 23.5694 73.3173 1.4776 5.9680 5.0873 40.1799 14.5310 2.2055 1.2237 40.3569 23.0619 29.1456 7.8720 0.1651 0.1361 7.4877 8.9596 6.7891 1.9162 3.8249 5.5369 8.6036 3.1653 23.8051 27.1352 4.5747 8.9049 28.9962 61.3972 19.3264 20.3871 8.8235 78.5522 43.7557 29.4274 8.9473 13.9699 8.1042 1.3458 22.7883 27.8111 22.8245 61.0224 24.2144 2.7256 30.2880 16.2758 1.2160 11.1261 36.2261 97.4985 22.4097 55.4210 32.8769 14.7255 24.3749 15.3965 1.2028 10.6525 13.5208 6.3279 21.9758 40.4443 26.5909 8.0028 44.7583
temp: 298.150 k
press: 1.00000 atm
elementType: 8 7 7 6 6 6 6 6 6 6 6 6 6 6 6 6 6 6 6 6 1 1 1 1 1 1 1 1 1 1 1 1 1 1
symmnumber: 1
zpe: 701308.5 jmol-1
zpe.correction: 0.267114 hartree
zpe.thermalcorrener: 0.283377 hartree
zpe.thermalcorrenthalpy: 0.284321 hartree
zpe.thermalcorrgfe: 0.223427 hartree
zpe.sumelectzpe: -839.583028 hartree
zpe.sumelectthermal: -839.566765 hartree
zpe.sumelectthermalent: -839.565821 hartree
zpe.sumelectthermalfe: -839.626715 hartree
dipole: -3.8649 5.8457 -0.2925
dipole: 7.0139
quadrupole: -117.7187 -108.2371 -121.3430
quadrupole: 8.6492 -0.9372 5.3528
quadrupole: -1.9525 7.5292 -5.5767 8.6492 -0.9372 5.3528
hfenergy: -839.8501419 hartree
pointgroup: C01 [X(C17H14N2O1)]
dipole: -1.610782 2.238346 -0.0998871 debye
polarizability: 361.743749|5.0860331|216.5674684|-2.274648|6.7681656|89.4675791 unknown
InChI: InChI=1S/C17H14N2O/c1-10-11-6-7-18-8-13(11)14(9-20)16-12-4-2-3-5-15(12)19-17(10)16/h2-8,19-20H,9H2,1H3
charge 0 multiplicity 1
34 atoms
O  -0.115777 -3.248953 0.913105
N  -1.462451 1.916115 0.093832
N  4.331035 -1.038171 -0.118279
C  -0.507757 -0.180822 -0.092598
C  -0.232288 1.241274 0.033139
C  0.551517 -1.102531 -0.193045
C  -1.970145 -0.329288 -0.083434
C  1.059283 1.780477 0.069228
C  1.896979 -0.590968 -0.127767
C  2.144042 0.84172 -0.003535
C  -2.520359 0.994899 0.029017
C  0.236751 -2.577252 -0.361489
C  -2.860534 -1.432252 -0.133955
C  1.311262 3.271944 0.184063
C  -3.907763 1.237865 0.069374
C  3.516378 1.265428 0.039742
C  3.050749 -1.453579 -0.166052
C  -4.252368 -1.198716 -0.094399
C  -4.769428 0.121014 0.00277
C  4.545092 0.328142 -0.024209
H  -1.574289 2.922689 0.180928
H  -0.591086 -2.692802 -1.090022
H  1.091817 -3.153984 -0.739843
H  -2.4940 -2.461218 -0.199548
H  1.875743 3.518177 1.103107
H  1.90162 3.649426 -0.671764
H  0.375869 3.856387 0.212687
H  -4.309468 2.253418 0.153065
H  3.762912 2.327633 0.126819
H  2.918607 -2.539224 -0.218438
H  -4.943683 -2.046857 -0.1343
H  -5.853651 0.275098 0.033141
H  5.595757 0.636237 0.0054
H  -0.718368 -2.654426 1.430262
