program: Gaussian 09
title: 000158326
version: EM64L-G09RevD.01
frameworkgroup: C1[X(C17H14N2O)]
method: RPBEPBE
basis: SDD
operation: Freq
keyword: #p
keyword: freq=noraman
keyword: PBEPBE/SDD
title: #p freq=noraman PBEPBE/SDD
converged: NO YES NO YES
title: Mulliken charges:
elementType: O N N C C C C C C C C C C C C C C C C C H H H H H H H H H H H H H H
charge: -0.452682 -0.486032 0.006449 0.089816 -0.035970 0.073575 0.128744 0.180357 0.255772 0.174049 0.377097 0.207399 -0.792728 -0.831880 -0.431146 -0.336123 -0.548672 -0.469724 -0.188953 -0.390986 0.304016 0.248538 0.215158 0.248578 0.245183 0.245165 0.205639 0.237632 0.238270 0.249866 0.210349 0.226381 0.236579 0.360286
chargesum: 0.00000
title: Mulliken charges with hydrogens summed into heavy atoms:
elementType: O N N C C C C C C C C C C C C C C C C C
charge: -0.092397 -0.182016 0.006449 0.089816 -0.035970 0.073575 0.128744 0.180357 0.255772 0.174049 0.377097 0.207399 -0.080454 -0.135892 -0.193515 -0.097853 -0.298806 -0.259375 0.037428 -0.154406
polarizability: 3.66075908e+02 -6.23348122e+00 2.22740189e+02 -4.65815627e-03 5.86943600e-03 8.59557036e+01
1716.lowfreq: -50.6622 -0.0010 -0.0005 0.0002 3.5813 7.0758 9.9100 36.9236 56.0318
frequency: -50.4771 36.4001 55.9842 75.0092 101.3300 139.2755 169.9802 173.8877 230.5013 258.5055 274.5767 280.5619 322.4770 332.4975 361.1711 368.8898 383.1607 439.2323 450.1569 467.2958 497.1130 503.2509 525.9321 536.3227 571.7538 587.5544 592.4078 612.1570 629.0697 631.4883 681.1232 715.1887 722.6223 746.7422 781.3341 815.5390 820.1642 831.8944 832.6646 834.7693 919.0488 923.7788 940.9098 962.6099 1008.5709 1012.4299 1030.5321 1031.8923 1034.4588 1059.5210 1074.4465 1080.6754 1127.9008 1152.8787 1170.0710 1195.4282 1223.3952 1245.4142 1276.3487 1294.8542 1306.1674 1341.9130 1350.1531 1374.8586 1395.7088 1402.2225 1411.8452 1417.0497 1426.2022 1431.7632 1455.6544 1466.3803 1469.5845 1478.2828 1482.4630 1491.6835 1498.6536 1555.4257 1590.5786 1598.5890 1629.3773 1637.2887 2974.8004 3019.7120 3048.8016 3074.7588 3095.2264 3112.9551 3127.0741 3132.2923 3141.7951 3147.7573 3160.3990 3164.7934 3565.8252 3621.1121
redmass: 1.4190 1.6105 2.2040 2.0345 3.1548 2.7004 4.8467 5.7840 4.3172 5.2409 4.1098 3.0873 5.6258 3.5052 3.8115 1.3117 3.8296 3.4199 4.7076 5.0604 5.2375 1.1347 7.0350 3.7446 5.1205 4.1622 4.1679 4.4794 5.3949 4.9649 5.2870 1.9953 6.0755 2.7828 3.9161 3.9883 3.7463 1.4330 1.4505 4.2800 1.5915 3.1422 1.3127 1.4140 5.1682 3.6336 1.5034 2.4109 1.5824 2.2420 1.9251 2.4978 2.6550 2.4959 1.1304 1.6880 1.9077 1.6120 2.1072 3.1503 2.5473 3.9578 5.1939 2.1659 2.8752 1.3936 1.3548 2.5146 3.8183 2.1410 3.3692 1.0443 1.0426 2.5955 1.1243 2.2530 1.9716 8.8436 6.5699 6.2425 6.7909 7.5329 1.0378 1.0390 1.0980 1.0967 1.0963 1.0887 1.0977 1.0870 1.0891 1.0885 1.0976 1.0993 1.0655 1.0796
irintensity: 0.4950 0.1573 0.0512 0.3866 5.2230 0.1070 0.0248 0.2111 6.2941 3.6447 11.0099 0.3914 2.0631 5.2012 0.7531 102.1259 3.5650 0.7065 7.4225 0.0098 1.6557 84.3051 3.3645 3.3276 1.1035 1.7960 0.1778 6.4204 3.2390 3.8710 0.6830 52.6009 2.4706 26.8847 42.3978 4.5488 0.1299 11.5823 37.0998 19.2746 0.8462 8.8746 1.1025 0.0046 11.9955 89.9215 2.7845 27.3558 1.2887 2.0213 2.5073 0.6398 12.7261 24.3241 12.1333 23.7929 4.5407 69.8652 47.7243 56.4331 7.6033 24.1385 60.3222 37.6209 2.2309 10.4834 1.0418 7.8141 46.9324 15.9151 121.9449 13.2490 11.1471 28.3080 4.1517 15.8131 40.3337 3.3464 64.0594 39.0904 172.8558 18.3014 42.5953 13.8161 16.8524 26.5055 9.7255 14.3424 13.1750 6.9837 9.4324 31.8573 40.6585 23.9033 34.5444 42.5438
temp: 298.150 k
press: 1.00000 atm
elementType: 8 7 7 6 6 6 6 6 6 6 6 6 6 6 6 6 6 6 6 6 1 1 1 1 1 1 1 1 1 1 1 1 1 1
symmnumber: 1
zpe: 698345.8 jmol-1
zpe.correction: 0.265986 hartree
zpe.thermalcorrener: 0.281730 hartree
zpe.thermalcorrenthalpy: 0.282674 hartree
zpe.thermalcorrgfe: 0.223117 hartree
zpe.sumelectzpe: -839.591826 hartree
zpe.sumelectthermal: -839.576082 hartree
zpe.sumelectthermalent: -839.575138 hartree
zpe.sumelectthermalfe: -839.634695 hartree
dipole: -5.1433 3.1792 -0.0003
dipole: 6.0465
quadrupole: -114.0205 -96.7107 -122.7270
quadrupole: 16.3875 0.0039 0.0017
quadrupole: -2.8677 14.4420 -11.5743 16.3875 0.0039 0.0017
hfenergy: -839.8578116 hartree
pointgroup: C01 [X(C17H14N2O1)]
dipole: 2.0660356 -1.1792459 -0.000099 debye
polarizability: 366.3363362|-1.2082342|222.4797607|0.0048606|-0.0057029|85.9557036 unknown
InChI: InChI=1S/C17H14N2O/c1-9-12-8-18-7-6-11(12)10(2)17-15(9)16-13(19-17)4-3-5-14(16)20/h3-8,19-20H,1-2H3
charge 0 multiplicity 1
34 atoms
O  2.583219 2.612793 -0.000355
N  1.199681 -1.936681 0.000287
N  -4.408299 1.324573 -0.000151
C  0.401844 0.239944 0.00026
C  0.027673 -1.170035 0.000208
C  1.883675 0.26477 0.000222
C  -0.615786 1.222372 0.000406
C  -1.286799 -1.649646 0.000127
C  2.324854 -1.108095 0.000285
C  -1.989433 0.764428 0.000182
C  -2.318372 -0.658519 0.000058
C  2.91414 1.246699 -0.000044
C  -0.285124 2.703295 0.00073
C  -1.611735 -3.132142 0.000075
C  3.674937 -1.51495 0.00027
C  -3.709853 -1.017172 -0.000098
C  -3.107128 1.676435 0.000003
C  4.277655 0.861162 -0.000082
C  4.653416 -0.50242 0.000098
C  -4.692413 -0.030994 -0.000169
H  1.233556 -2.95229 0.000324
H  0.325262 2.967607 -0.878191
H  -1.1769 3.344418 0.001832
H  0.326827 2.966793 0.878781
H  -2.203547 -3.41711 0.890396
H  -2.204228 -3.416878 -0.889863
H  -0.708169 -3.765655 -0.000383
H  3.952022 -2.573619 0.000348
H  -4.006992 -2.070116 -0.000161
H  -2.933069 2.756174 -0.000035
H  5.054392 1.637205 -0.000283
H  5.716046 -0.766702 0.000064
H  -5.757132 -0.288823 -0.000278
H  3.408978 3.159079 -0.000661
