program: Gaussian 09
title: 000158345
version: EM64L-G09RevD.01
frameworkgroup: C1[X(C17H12N2O2)]
method: RPBEPBE
basis: SDD
operation: Freq
keyword: #p
keyword: freq=noraman
keyword: PBEPBE/SDD
title: #p freq=noraman PBEPBE/SDD
converged: YES YES NO NO
title: Mulliken charges:
elementType: O O N N C C C C C C C C C C C C C C C C C H H H H H H H H H H H H
charge: -0.360102 -0.168925 0.021884 -0.059911 0.128118 0.108195 -0.337192 0.267411 0.179446 0.321116 0.176532 -0.042521 -0.834934 -0.389093 -0.319694 -0.342821 -0.341557 -0.265899 -0.221770 -0.279285 -0.220069 0.253608 0.253922 0.212799 0.287669 0.244809 0.228615 0.259828 0.281260 0.133188 0.221305 0.224656 0.379411
chargesum: 0.00000
title: Mulliken charges with hydrogens summed into heavy atoms:
elementType: O O N N C C C C C C C C C C C C C C C C C
charge: 0.019309 -0.168925 0.021884 -0.059911 0.128118 0.108195 -0.337192 0.267411 0.179446 0.321116 0.176532 -0.042521 -0.114604 -0.101424 -0.074885 -0.114207 -0.081729 0.015361 -0.088582 -0.057980 0.004586
polarizability: 4.55290304e+02 8.80646478e+00 2.38757285e+02 -3.45977711e+00 -7.54616300e-01 8.43535214e+01
1716.lowfreq: -7.2818 -0.0005 0.0004 0.0005 3.4935 8.3971 29.7939 52.0230 63.5561
frequency: 29.6350 51.9967 63.5518 86.3506 95.4420 134.4342 148.0994 155.1458 195.5933 217.0241 251.0444 261.7080 268.7904 304.2145 334.1069 344.0915 358.3348 378.7056 430.2718 434.4500 454.8051 471.8942 525.3478 542.4738 561.3506 573.2346 584.8952 601.7232 617.8354 662.1998 679.0575 705.4019 738.3261 746.5442 766.1741 777.4238 813.5531 828.8394 860.4523 873.0681 893.2489 899.9140 924.0654 942.6634 946.5262 961.8062 981.3618 1016.7150 1020.7500 1035.5234 1065.7512 1092.9198 1098.1707 1121.6856 1145.9183 1158.0133 1196.6530 1215.5862 1242.0260 1295.8250 1310.1057 1332.7518 1344.2403 1358.0631 1378.7160 1397.2970 1405.7346 1414.5816 1419.4843 1445.9162 1458.5775 1467.6896 1477.0451 1487.9156 1515.1758 1531.5323 1570.8116 1587.5306 1606.0143 1615.3350 1628.5427 2835.3765 2984.9334 3059.3979 3101.7719 3126.6506 3142.3816 3158.8345 3168.7639 3187.4566 3211.5294 3217.2921 3446.1939
redmass: 2.7783 3.7795 3.8760 2.6060 2.8398 2.8111 4.4149 2.9097 7.3508 4.9972 2.3526 5.4419 1.6187 7.0443 4.5691 3.9528 6.0850 4.0937 3.5899 4.5644 3.3802 5.7848 5.6941 4.7506 4.0022 5.8156 6.7072 4.2908 6.0456 6.3207 6.7027 2.5706 5.1033 1.5588 1.6464 3.5653 5.4653 2.6245 2.0342 1.4923 5.8322 3.8109 1.3279 1.4069 2.8882 3.4803 1.3244 2.0408 3.5570 1.5728 2.2371 2.5119 3.4232 2.9657 1.7457 1.4059 2.2917 2.1954 1.8056 1.6227 1.6395 1.6396 6.5629 2.6239 5.2067 3.0017 1.2135 2.5922 1.6832 4.4450 2.9270 1.0589 3.5394 1.4150 3.2643 5.2419 6.4937 5.6675 7.0227 8.7681 7.9444 1.0793 1.0399 1.0972 1.0955 1.0852 1.0898 1.0947 1.0988 1.0884 1.0917 1.0985 1.0686
irintensity: 1.2132 0.6639 2.7148 1.0167 6.3070 1.4395 2.4068 4.8315 10.3807 1.0770 58.4911 1.2307 61.7082 0.6409 4.7662 1.8421 0.6118 2.4161 3.4049 0.4452 24.1599 1.1151 12.8796 2.1818 1.3352 1.4724 6.9909 0.7131 1.9820 15.7496 3.4904 2.2032 21.2645 89.3495 22.6325 11.8737 15.0414 25.5168 13.3724 1.9143 20.1506 11.5229 0.6249 2.2329 6.2926 10.4829 0.6938 8.8456 17.3278 2.6515 15.1824 28.2202 6.2321 11.4454 22.7692 17.9557 22.9604 31.6887 20.6003 43.8847 19.4592 73.3634 14.9278 39.8251 35.2178 100.0209 5.4510 143.2259 29.5665 53.6812 11.4512 15.4067 16.3390 53.2188 9.8538 41.6827 9.4868 292.0236 51.8298 23.1449 47.3464 126.8090 16.2689 10.0318 21.7136 3.4260 15.6865 28.9211 40.4994 5.7541 0.8086 1.4670 37.7426
temp: 298.150 k
press: 1.00000 atm
elementType: 8 8 7 7 6 6 6 6 6 6 6 6 6 6 6 6 6 6 6 6 6 1 1 1 1 1 1 1 1 1 1 1 1
symmnumber: 1
zpe: 643449.5 jmol-1
zpe.correction: 0.245077 hartree
zpe.thermalcorrener: 0.262303 hartree
zpe.thermalcorrenthalpy: 0.263247 hartree
zpe.thermalcorrgfe: 0.199705 hartree
zpe.sumelectzpe: -913.453367 hartree
zpe.sumelectthermal: -913.436141 hartree
zpe.sumelectthermalent: -913.435197 hartree
zpe.sumelectthermalfe: -913.498739 hartree
dipole: -8.5537 -7.6762 1.8058
dipole: 11.6341
quadrupole: -84.5127 -128.9749 -124.6646
quadrupole: -6.3465 -9.6349 -2.7034
quadrupole: 28.2047 -16.2575 -11.9472 -6.3465 -9.6349 -2.7034
hfenergy: -913.6984442 hartree
pointgroup: C01 [X(C17H12N2O2)]
dipole: 3.3221358 -3.0901594 -0.6042286 debye
polarizability: 454.9983426|-12.0432707|238.9456335|-2.4408632|-4.2716636|84.457135 unknown
InChI: InChI=1S/C17H12N2O2/c1-10-13-8-19(21)7-6-11(13)14(9-20)17-16(10)12-4-2-3-5-15(12)18-17/h2-9,21H,1H3
charge 0 multiplicity 1
33 atoms
O  5.192463 -1.834609 0.169109
O  -0.043758 3.949835 -0.072602
N  -1.838615 1.615461 -0.107161
N  4.058884 -0.960702 -0.021527
C  -0.7665 -0.499473 0.001637
C  0.330533 -1.348865 0.007891
C  -0.638823 0.991914 -0.063952
C  1.652159 -0.73173 -0.013461
C  -2.206886 -0.744179 0.012508
C  1.805507 0.745488 -0.052895
C  0.67118 1.602998 -0.096259
C  -2.803372 0.571432 -0.057253
C  0.131579 -2.853395 0.037482
C  2.808368 -1.525574 0.011524
C  3.167637 1.243902 0.010095
C  -3.033206 -1.891188 0.07742
C  -4.203356 0.733909 -0.06803
C  4.268231 0.412789 0.033131
C  0.847071 3.069652 -0.209808
C  -4.437499 -1.721225 0.0666
C  -5.013594 -0.423691 -0.006625
H  -0.539714 -3.164216 -0.783545
H  -0.351163 -3.161562 0.984012
H  1.058966 -3.437629 -0.063268
H  2.80008 -2.6133 0.062671
H  3.363257 2.315344 0.06531
H  -2.617574 -2.901496 0.142136
H  -4.63459 1.73811 -0.121062
H  5.303503 0.745299 0.107185
H  1.886686 3.395726 -0.472004
H  -5.089959 -2.599908 0.117597
H  -6.104972 -0.320934 -0.012605
H  5.556678 -2.003381 -0.746652
