program: Gaussian 09
title: 000158296
version: EM64L-G09RevD.01
frameworkgroup: C1[X(C5H7F3N2O2S)]
method: RPBEPBE
basis: SDD
operation: Freq
keyword: #p
keyword: freq=noraman
keyword: PBEPBE/SDD
title: #p freq=noraman PBEPBE/SDD
converged: YES YES NO NO
title: Mulliken charges:
elementType: S F F F O O N N C C C C C H H H H H H H
charge: 0.286499 -0.168483 -0.119190 -0.169004 -0.317719 -0.216765 -0.372840 0.106190 -0.261190 0.433195 -0.846905 0.319852 -0.600466 0.260971 0.292707 0.292077 0.336425 0.271603 0.236502 0.236538
chargesum: 0.00000
title: Mulliken charges with hydrogens summed into heavy atoms:
elementType: S F F F O O N N C C C C C
charge: 0.286499 -0.168483 -0.119190 -0.169004 -0.317719 -0.216765 -0.036414 0.106190 -0.261190 0.433195 -0.001149 0.319852 0.144177
polarizability: 1.54187380e+02 -1.38154236e+01 1.03572860e+02 1.86477271e-01 1.06943413e-01 5.49686382e+01
1716.lowfreq: -6.7369 -5.3019 -3.2486 -0.0021 -0.0011 0.0018 16.9441 34.4673 53.2820
frequency: 16.4585 34.4045 53.2673 67.6053 71.2054 80.2669 154.1924 163.6775 175.7277 190.2991 194.5335 236.0714 262.6757 303.8210 337.1054 345.3288 453.7546 460.3561 500.7922 553.9443 585.0324 589.2012 640.2251 650.4341 678.4364 713.0101 825.0497 895.8681 939.4590 962.2417 979.4601 1000.6930 1025.3052 1063.5089 1125.0834 1149.6056 1190.6128 1242.9807 1352.4880 1433.2558 1447.0863 1458.4961 1464.2824 1482.3186 1510.8193 1518.1811 1763.5642 2987.4147 3034.0934 3068.7764 3118.0153 3153.5638 3175.5367 3569.7624
redmass: 4.7994 5.5098 4.2018 6.2031 5.7334 1.1585 4.5649 8.0058 1.2765 4.3755 5.7813 4.9872 6.5861 5.5739 13.3476 15.4275 15.5840 12.4280 9.9070 10.7670 1.1371 11.9025 9.6786 10.7994 12.1476 8.2276 5.3409 12.6799 6.0999 3.1300 1.6381 1.5188 5.1930 6.8625 1.2826 1.6460 2.4074 11.1599 1.1287 1.1524 1.0522 1.2954 1.0552 1.0434 1.8014 3.7293 10.4501 1.0350 1.0287 1.1029 1.0991 1.1030 1.1069 1.0774
irintensity: 4.2883 3.6557 1.8930 1.4795 0.7543 0.2035 1.6505 1.6928 0.0714 0.0025 1.9948 1.1443 0.8025 37.5997 0.0957 0.3624 0.1279 3.1284 0.0478 8.0107 140.8434 1.2516 10.1762 8.3911 20.0409 16.1249 153.8236 618.5232 84.9766 131.7356 119.0415 6.3587 336.3244 92.3763 0.0151 45.4325 170.2188 139.8364 0.2406 21.9044 14.9266 166.9620 21.7557 16.9951 170.9407 59.7882 290.9249 68.4499 14.2292 32.0981 3.7408 3.1545 4.5700 36.8030
temp: 298.150 k
press: 1.00000 atm
elementType: 16 9 9 9 8 8 7 7 6 6 6 6 6 1 1 1 1 1 1 1
symmnumber: 1
zpe: 337642.1 jmol-1
zpe.correction: 0.128601 hartree
zpe.thermalcorrener: 0.143775 hartree
zpe.thermalcorrenthalpy: 0.144720 hartree
zpe.thermalcorrgfe: 0.083293 hartree
zpe.sumelectzpe: -1151.202885 hartree
zpe.sumelectthermal: -1151.187710 hartree
zpe.sumelectthermalent: -1151.186766 hartree
zpe.sumelectthermalfe: -1151.248193 hartree
dipole: 1.5536 5.9406 -0.0176
dipole: 6.1404
quadrupole: -60.6772 -83.6498 -83.0353
quadrupole: 3.2742 0.1281 -0.0638
quadrupole: 15.1102 -7.8624 -7.2479 3.2742 0.1281 -0.0638
hfenergy: -1151.3314857 hartree
pointgroup: C01 [X(C5H7F3N2O2S1)]
dipole: 1.0619649 2.1667927 0.1160245 debye
dipolederiv: 0.188303 -0.0618909 -0.0248568 0.4098297 -0.4521311 -0.0872487 0.0326243 -0.0454023 -0.0267099 -0.719678 0.0741407 -0.2283314 0.0535331 -0.3805898 0.1143817 -0.2414745 0.1321391 -0.5347591 -0.3531317 -0.1432416 -0.004639 -0.0812724 -0.8060891 -0.0535305 0.0018734 -0.0470059 -0.25389 -0.6147695 -0.0029139 0.2468618 -0.0232992 -0.3360445 -0.060331 0.2581789 -0.0818786 -0.686576 -2.1870531 0.6167234 0.2809341 0.0817315 -0.3891796 -0.0351199 0.2241625 -0.0929603 -0.1877539 -0.7158299 0.0906695 0.0514334 0.1388562 -1.0993524 -0.1030169 0.0576646 -0.0990739 -0.3355001 -1.4299353 -0.103609 0.0848218 -0.3314631 -0.4998582 0.0346269 0.0586074 0.0105631 -0.5068361 0.8954402 -0.026125 -0.1020334 0.7259997 -0.6435757 -0.140444 -0.0198515 -0.0583949 -0.0645423 -0.55939 -0.2203669 0.0142221 -0.5788895 0.93386 0.1799377 -0.0286078 0.1442938 -0.1392483 1.8821376 0.1829968 -0.0175576 0.245968 1.3609592 -0.0442362 -0.0089629 -0.0398072 1.516815 0.1606113 -0.0987673 -0.0159702 -0.1312673 0.0385045 0.0127261 -0.0237735 0.0109637 0.0440005 2.7141068 -0.3011428 -0.2823334 -0.3927015 1.7494353 0.2026891 -0.2954797 0.1942882 0.3793935 0.6290558 -0.029723 -0.0417817 -0.2539905 0.0522476 0.0021597 -0.0672875 -0.0208893 0.2729041 0.0505371 -0.0065202 0.0047181 0.0042482 -0.0790866 -0.0305504 0.0062717 -0.0282631 0.1369506 -0.028921 0.0450095 0.0706181 -0.0003033 0.1047592 0.0726135 0.0552679 0.045651 0.0096182 -0.0499377 0.0598449 -0.0533409 0.0061062 0.1244415 -0.0446787 -0.0501903 -0.0253815 -0.0002608 0.1944691 0.0053218 0.0200546 0.099214 0.1586106 -0.0351459 0.0307391 -0.0251063 0.3704571 0.1375447 -0.0678016 -0.0075641 0.0571938 -0.0286507 -0.0242573 0.0065323 -0.0112377 0.1340393 -0.1188075 -0.0051504 -0.0666129 -0.0078548 0.1118954 -0.0608304 -0.1375847 -0.0438216 -0.0575623 -0.074752 -0.0074539 0.0713573 -0.0216389 0.0798443 0.1002551 0.1412905 0.0813238 -0.0705397 unknown
polarizability: 145.7629146|-21.4104375|109.9035777|-11.6146801|8.2494285|57.0623859 unknown
InChI: InChI=1S/C5H7F3N2O2S/c1-9-4(11)12-10-3(13-2)5(6,7)8/h9H,1-2H3
charge 0 multiplicity 1
20 atoms
S  -0.510301 2.190946 0.475307
F  -2.939201 0.216332 -0.638795
F  -2.018868 -1.670203 0.201241
F  -2.697087 -0.034607 1.607883
O  1.542778 0.288791 0.04848
O  2.639401 -1.830684 -0.309818
N  3.789299 0.227028 -0.194907
N  0.301702 -0.446615 0.094439
C  -0.699344 0.385145 0.290179
C  -2.055588 -0.28729 0.359902
C  -2.275175 2.834125 0.698896
C  2.697972 -0.600679 -0.175021
C  5.147286 -0.289887 -0.398128
H  -2.141978 3.917713 0.839675
H  -2.738765 2.390259 1.589193
H  -2.873637 2.637589 -0.199811
H  3.63142 1.226938 -0.064302
H  5.084905 -1.383209 -0.513688
H  5.793005 -0.061428 0.468948
H  5.602575 0.137135 -1.309973
