program: Gaussian 09
title: 000158291
version: EM64L-G09RevD.01
frameworkgroup: C1[X(C4H9NO3)]
method: RPBEPBE
basis: SDD
operation: Freq
keyword: #pfreq=noraman
keyword: PBEPBE/SDD
title: #p freq=noraman PBEPBE/SDD
converged: YES YES NO NO
title: Mulliken charges:
elementType: O O O N C C C C H H H H H H H H H
charge: -0.440045 -0.202412 -0.220651 0.128727 -0.043498 -0.071090 -0.719297 -0.686321 0.257643 0.230268 0.241167 0.246970 0.231091 0.238804 0.226976 0.231146 0.350520
chargesum: 0.00000
title: Mulliken charges with hydrogens summed into heavy atoms:
elementType: O O O N C C C C
charge: -0.089524 -0.202412 -0.220651 0.128727 0.214145 0.159179 -0.000069 0.010606
polarizability: 6.80365121e+01 4.80029751e+00 6.26771678e+01 7.54722341e-01 5.27189061e+00 5.85872081e+01
1716.lowfreq: -4.5152 -0.0004 0.0002 0.0004 11.5182 13.2839 46.9412 58.6377 166.5014
frequency: 46.7194 58.5901 166.4961 194.3788 217.9393 258.9763 264.6158 332.6595 354.9432 381.1394 444.9108 511.0051 652.1654 663.8402 799.6568 828.2139 885.1027 984.1955 1017.1037 1053.5608 1087.6757 1116.0019 1149.2270 1206.4819 1235.5685 1256.0829 1289.5412 1333.3075 1369.9137 1388.7431 1403.7307 1421.5785 1461.3616 1472.3567 1477.6672 1482.3992 2978.2215 2998.8980 3002.0584 3073.1127 3099.8032 3101.7974 3107.3362 3110.0157 3568.4357
redmass: 6.5182 3.7040 4.0652 1.0944 1.1327 3.6433 2.5945 1.3709 4.0070 2.3521 3.1351 3.7487 4.4591 7.1661 4.7328 2.1844 2.5950 1.2619 2.0883 1.8210 1.8572 2.6965 2.1202 2.0068 1.8667 1.6859 1.4075 1.2959 1.4185 1.2769 1.2765 3.5409 1.0629 1.0563 1.0463 1.0433 1.0850 1.0355 1.0362 1.0882 1.0994 1.0999 1.1002 1.1000 1.0664
irintensity: 0.3409 3.3278 5.5099 1.8928 10.5675 9.6244 21.3807 122.8832 6.0898 17.2597 15.4860 0.1739 8.5943 0.5676 21.2940 9.2220 52.5718 16.9602 44.0174 11.6424 18.0320 7.7169 56.5611 19.0670 88.3945 12.8319 10.1256 6.8241 8.0862 45.9264 24.8566 97.6232 18.0675 10.0939 6.1631 20.7695 18.7781 12.5756 7.9865 1.5126 11.4411 15.3928 14.6886 23.3800 13.3236
temp: 298.150 k
press: 1.00000 atm
elementType: 8 8 8 7 6 6 6 6 1 1 1 1 1 1 1 1 1
symmnumber: 1
zpe: 354737.8 jmol-1
zpe.correction: 0.135112 hartree
zpe.thermalcorrener: 0.144571 hartree
zpe.thermalcorrenthalpy: 0.145515 hartree
zpe.thermalcorrgfe: 0.100387 hartree
zpe.sumelectzpe: -437.498552 hartree
zpe.sumelectthermal: -437.489094 hartree
zpe.sumelectthermalent: -437.488149 hartree
zpe.sumelectthermalfe: -437.533277 hartree
dipole: 2.5367 2.2644 0.0472
dipole: 3.4007
quadrupole: -58.9686 -43.3881 -49.6871
quadrupole: -0.5461 3.9835 -0.9924
quadrupole: -8.2873 7.2931 0.9942 -0.5461 3.9835 -0.9924
hfenergy: -437.6336642 hartree
pointgroup: C01 [X(C4H9N1O3)]
dipole: 0.9817628 -0.9083913 -0.0316096 debye
dipolederiv: -0.9010019 0.1792667 0.0938499 0.1748191 -0.4578597 0.1934975 0.0843912 0.2069133 -0.3431475 -0.5084845 0.2292958 0.1715176 0.2631766 -0.3813364 -0.2293607 0.0384775 -0.1317984 -0.5811931 -0.4281837 0.066163 -0.1595967 0.1550735 -0.3278008 -0.0511702 -0.088475 -0.1726267 -0.7130555 0.8094968 -0.3644553 0.0424218 -0.5891989 0.3441004 0.2950575 0.1756651 0.3211066 1.0418247 -0.2373763 0.0705794 -0.0156561 -0.0062968 0.1544979 -0.0106887 0.0642778 -0.0287212 0.100583 0.8645267 -0.1067957 -0.0360551 0.0013934 0.4433138 -0.0286591 -0.1601479 -0.018177 0.2578946 -0.0438506 -0.0378765 0.0060588 -0.0179297 -0.0736847 -0.0064631 -0.0559029 0.0300274 0.0438957 -0.0113817 -0.0558198 0.0140142 -0.0031672 -0.1633094 -0.0371858 0.031896 -0.0341229 0.0575003 0.0341013 0.0203213 -0.0007161 0.0268496 0.0283146 -0.0548821 -0.0136697 -0.0187148 -0.0415046 -0.029986 0.0139865 -0.0566482 -0.0166707 0.0044278 -0.0504894 -0.0290207 -0.0060777 -0.1276512 0.1134424 0.0052438 0.0086541 -0.0011954 0.0775689 0.0147431 0.0149131 -0.0627792 -0.0887104 -0.0319232 -0.1037867 0.0808541 -0.0531198 0.0327855 0.0203016 0.0813619 0.0286439 0.065659 -0.0250764 0.1023215 -0.0778165 0.0808002 0.055996 0.0168903 -0.057031 0.0138081 0.0794413 -0.0182601 -0.1066949 0.0819127 -0.0845715 0.0307462 0.0375297 0.0924302 0.0508924 0.0404369 -0.0560671 0.1098052 -0.0382193 0.0635418 0.0579676 0.0042615 -0.0402397 0.0038551 0.0848658 0.1015423 -0.010177 -0.0271007 0.0094398 0.0774584 0.0283148 -0.047817 -0.0275557 -0.1087683 0.3684819 -0.0113772 -0.0874743 -0.002944 0.0968141 -0.1416968 -0.0911088 -0.1546733 0.2319292 unknown
polarizability: 67.8900939|-5.0200865|62.3818257|-0.6207458|5.3158515|59.0289685 unknown
InChI: InChI=1S/C4H9NO3/c1-3(4(2)6)5(7)8/h3-4,6H,1-2H3
charge 0 multiplicity 1
17 atoms
O  2.408713 -0.42361 0.059893
O  -2.019841 0.857152 0.76812
O  -1.654339 -0.041886 -1.298785
N  -1.338838 0.148949 -0.062419
C  -0.034656 -0.487452 0.429428
C  1.146847 0.23401 -0.308601
C  -0.077422 -2.001269 0.173335
C  1.290071 1.700901 0.102389
H  0.004284 -0.260148 1.507735
H  0.958352 0.146624 -1.39984
H  -0.090813 -2.222179 -0.908101
H  -0.974026 -2.455151 0.628794
H  0.806143 -2.469664 0.639334
H  2.107973 2.169726 -0.468791
H  0.361083 2.266605 -0.084691
H  1.535016 1.771688 1.17658
H  2.511455 -1.263993 -0.453878
