program: Gaussian 09
title: 000158290
version: EM64L-G09RevD.01
frameworkgroup: C1[X(C7H13N3)]
method: RPBEPBE
basis: SDD
operation: Freq
keyword: #pfreq=noraman
keyword: PBEPBE/SDD
title: #p freq=noraman PBEPBE/SDD
converged: YES YES NO NO
title: Mulliken charges:
elementType: N N N C C C C C C C H H H H H H H H H H H H H
charge: -0.384124 -0.597898 -0.101109 -0.480724 -0.056431 0.107974 0.182109 -0.714420 -0.775425 -0.255512 0.182076 0.235573 0.190341 0.189995 0.262190 0.221129 0.300250 0.253911 0.269477 0.232568 0.244281 0.237160 0.256609
chargesum: 0.00000
title: Mulliken charges with hydrogens summed into heavy atoms:
elementType: N N N C C C C C C C
charge: -0.083874 -0.074509 -0.101109 -0.063075 0.133910 0.107974 0.182109 -0.041107 -0.061416 0.001097
polarizability: 1.13776658e+02 6.67222383e-01 1.00900517e+02 6.61784248e+00 -6.48270486e-01 6.54234010e+01
1716.lowfreq: -14.0003 -8.9533 -0.0006 0.0004 0.0006 7.2934 14.9199 74.3885 98.6232
frequency: 14.4219 74.3821 98.5822 114.7929 207.7565 217.0434 233.8780 256.5310 312.0675 342.6323 380.8818 426.8365 450.0753 586.6018 615.3055 639.3637 647.0797 686.6800 765.9308 779.7308 836.9198 879.4298 917.5393 958.6862 962.3533 995.2260 1034.8949 1042.9801 1092.1892 1107.5569 1155.9849 1214.1982 1222.7158 1233.0919 1275.4876 1285.0437 1331.7845 1344.1446 1368.2145 1387.6391 1403.6245 1406.4104 1445.5905 1452.9717 1468.4851 1469.6418 1477.1681 1481.0372 1590.6950 1633.7487 2853.9352 2967.1403 2974.3020 2979.6333 3036.8833 3052.6028 3067.4423 3091.9051 3103.1877 3233.1691 3441.7327 3571.7769 3581.4033
redmass: 3.0302 2.8285 1.1354 3.1067 1.1195 3.4234 1.8350 1.3498 2.7806 3.1422 2.6991 2.0800 2.4830 1.3601 2.5030 2.6758 1.5847 5.0357 1.5920 3.3158 2.7565 1.5348 5.4737 1.9261 1.7740 1.5189 1.7104 1.4494 1.7451 2.0761 2.5887 1.7694 1.3929 1.7181 2.1744 1.4977 2.5435 1.4293 1.5449 1.2847 1.3432 3.9481 1.7053 1.2970 1.0456 1.0523 1.0654 1.2349 5.8875 1.1007 1.0824 1.0389 1.0399 1.0614 1.0986 1.0979 1.0977 1.0953 1.0986 1.0983 1.0446 1.0975 1.0817
irintensity: 1.8451 1.1053 0.3502 3.2439 5.8343 0.3895 15.0741 26.8422 17.3829 9.0033 5.9127 4.0668 21.0307 205.1545 71.2914 7.1264 42.9044 2.6907 19.7576 14.8182 0.8427 1.0706 1.9938 2.0666 1.3590 0.3743 7.9052 2.1080 27.6914 1.1260 14.4422 23.0526 11.7412 11.0275 3.6146 0.5338 18.3921 36.2944 3.4708 37.4359 3.7849 16.1809 20.9223 3.9648 22.8497 4.6084 2.2828 2.3921 20.6528 44.9012 96.3536 54.1144 57.1304 28.2254 24.4275 16.2986 45.5802 15.8442 14.4884 3.3833 3.0335 0.1403 29.1354
temp: 298.150 k
press: 1.00000 atm
elementType: 7 7 7 6 6 6 6 6 6 6 1 1 1 1 1 1 1 1 1 1 1 1 1
symmnumber: 1
zpe: 516075.8 jmol-1
zpe.correction: 0.196563 hartree
zpe.thermalcorrener: 0.207737 hartree
zpe.thermalcorrenthalpy: 0.208682 hartree
zpe.thermalcorrgfe: 0.158604 hartree
zpe.sumelectzpe: -438.008420 hartree
zpe.sumelectthermal: -437.997245 hartree
zpe.sumelectthermalent: -437.996301 hartree
zpe.sumelectthermalfe: -438.046378 hartree
dipole: -2.9885 3.0381 -2.3543
dipole: 4.8687
quadrupole: -46.9386 -59.6073 -64.2635
quadrupole: 1.8650 -0.7943 0.9828
quadrupole: 9.9978 -2.6708 -7.3270 1.8650 -0.7943 0.9828
hfenergy: -438.2049826 hartree
pointgroup: C01 [X(C7H13N3)]
dipole: 1.1219057 1.3340582 0.7941922 debye
dipolederiv: -0.5955413 -0.1280806 -0.0656587 -0.1061682 -0.1975222 -0.0372987 -0.1297591 -0.0385281 -0.2543328 -0.7186941 0.1035842 -0.1886694 0.0958063 -0.3384948 -0.0933428 -0.2056619 -0.0867907 -0.6020068 -0.4947085 -0.0831781 -0.0557499 -0.0283508 -0.3411183 -0.0238935 -0.0348352 -0.0413582 -0.2734071 -0.047639 0.0617123 0.0149925 -0.0286975 0.115512 -0.0076282 0.1374012 0.0198575 0.0685248 0.66296 -0.0982604 0.1395491 -0.1495034 0.307995 0.0117304 -0.0393405 0.0474948 0.341527 0.3421762 -0.0764418 0.1024186 -0.0666928 -0.0062634 0.0040773 0.1581841 -0.0275531 -0.0915013 0.2604658 0.1513119 0.1013142 -0.0855484 0.1006386 -0.0208042 0.1005394 0.0705009 -0.0519756 -0.0237645 0.0211783 -0.0154828 0.0347458 -0.1311119 0.0525407 -0.0323037 0.0734778 0.0656567 0.0377204 -0.0288952 -0.0434165 0.0717438 -0.0025742 0.0178768 -0.045761 -0.0270495 0.1318766 0.2437051 0.199595 0.1321077 0.2251185 0.1796352 0.089228 0.1244833 0.0762984 -0.0790567 0.0215816 -0.0201603 0.012773 0.0247574 -0.1689979 0.1165084 0.0104184 0.0630606 0.0461903 0.0169568 -0.0291841 -0.0555812 -0.0340082 0.0267634 -0.1125872 -0.0450535 -0.0614815 -0.031221 -0.113614 -0.0264611 -0.1283105 -0.0575186 -0.0738896 -0.1018771 -0.1232966 -0.0715795 -0.1899221 -0.078781 -0.0575069 0.161603 -0.010659 0.0597525 0.0054028 0.1736243 0.0388443 -0.086005 0.0231191 0.1017261 -0.0728952 0.0887916 0.056962 0.0224681 -0.0899127 0.0135993 0.0866449 0.0558517 -0.0677517 -0.0562058 -0.0497687 0.0306921 -0.0523849 -0.0911221 -0.1161237 -0.0616042 0.1688089 -0.0345246 -0.0528906 -0.0417424 0.1718543 -0.0187364 -0.0548319 -0.0135547 0.3246794 0.1687431 -0.0352604 0.0132914 0.0268519 -0.0508196 0.0752198 0.0155992 0.0037246 0.3182983 0.0617982 0.0191397 0.0934091 0.0621138 0.2105585 0.076209 0.2199105 0.0786237 0.1521697 -0.0516614 -0.125044 0.1064957 -0.0645533 -0.0282593 0.0219688 0.1134003 0.0744115 0.0322493 -0.0473464 0.1209348 -0.0616943 0.0555176 0.0751524 0.0091667 -0.0597822 0.0446741 0.0818223 0.0954673 -0.0347097 -0.0351425 -0.0318805 -0.0278838 -0.0460766 -0.0514923 -0.1313045 -0.1111711 0.0123959 0.0662766 -0.0462567 0.0696452 0.0314189 0.0122326 -0.0504081 0.0107559 0.1825643 unknown
polarizability: 113.9707571|0.577235|100.7535834|5.9271268|-2.2347154|65.3762353 unknown
InChI: InChI=1S/C7H13N3/c1-5(8)3-7-6(2)9-4-10-7/h4-5,9H,3,8H2,1-2H3
charge 0 multiplicity 1
23 atoms
N  2.536927 -0.01153 0.330715
N  -3.335026 0.72987 -0.06704
N  0.85112 -1.397982 -0.234379
C  -1.005163 0.279755 -0.734283
C  -2.062177 0.134648 0.403046
C  0.402787 -0.058404 -0.32279
C  1.441829 0.819378 0.02737
C  -2.3084 -1.340687 0.771515
C  1.520634 2.317202 0.106288
C  2.134811 -1.332016 0.159866
H  -1.03913 1.323272 -1.1079
H  -1.324889 -0.369419 -1.56968
H  -1.649952 0.65425 1.305099
H  -3.001705 -1.424982 1.631309
H  -1.361068 -1.842787 1.026764
H  -2.755269 -1.866948 -0.091689
H  3.461988 0.308547 0.615229
H  -3.287453 1.736611 -0.258221
H  -4.14595 0.486521 0.511363
H  2.336127 2.72731 -0.520249
H  0.576245 2.759411 -0.25103
H  1.680365 2.675278 1.142004
H  2.792748 -2.182298 0.324197
