program: Gaussian 09
title: 000158287
version: EM64L-G09RevD.01
frameworkgroup: C1[X(C5H15N2O2P)]
method: RPBEPBE
basis: SDD
operation: Freq
keyword: #p
keyword: freq=noraman
keyword: PBEPBE/SDD
title: #p freq=noraman PBEPBE/SDD
converged: YES YES NO NO
title: Mulliken charges:
elementType: P O O N N C C C C C H H H H H H H H H H H H H H H
charge: 1.403285 -0.484946 -0.606700 -0.739599 -0.759533 -0.286323 -0.283798 -0.657074 -0.646222 -0.501244 0.318169 0.324337 0.229397 0.242303 0.210747 0.257078 0.220487 0.207143 0.219979 0.230406 0.199738 0.217356 0.223429 0.217855 0.243730
chargesum: 0.00000
title: Mulliken charges with hydrogens summed into heavy atoms:
elementType: P O O N N C C C C C
charge: 1.403285 -0.484946 -0.606700 -0.421430 -0.435196 0.185377 0.184026 -0.009465 0.001278 0.183771
polarizability: 1.18161086e+02 -1.43971055e+00 9.01939402e+01 2.19886041e+00 -1.25041008e+00 8.85258335e+01
1716.lowfreq: -8.0261 -0.0017 -0.0015 -0.0014 5.0952 11.7856 44.6374 48.6975 64.6415
frequency: 44.3657 48.6287 64.6022 69.9042 87.0230 108.8653 149.2327 161.2718 194.1883 238.4239 249.9820 267.6197 293.1929 315.1583 345.8981 387.9420 412.5405 467.6142 492.5301 563.0049 601.2936 745.4198 769.6457 811.3710 817.6248 928.7906 935.7530 973.2782 1039.2892 1074.2243 1085.0250 1110.5077 1116.4993 1119.3058 1125.3900 1130.7860 1139.4795 1263.5386 1272.5901 1343.9034 1349.1544 1386.2287 1389.0257 1396.6032 1401.4353 1422.4590 1457.0767 1470.0419 1470.3716 1471.8527 1474.6098 1478.5204 1485.6665 1497.3763 2956.2441 2964.4082 2970.5398 2978.7583 2979.9989 3045.3706 3049.1215 3051.8086 3074.9099 3078.9978 3090.7346 3094.5964 3108.4966 3508.0461 3554.1619
redmass: 3.0895 2.4847 2.6512 2.7289 1.6271 1.3618 2.5271 3.4984 2.6284 1.5411 1.3868 2.5626 3.7622 3.6560 3.8507 2.9518 1.9551 2.0428 6.1622 1.3450 6.7432 2.5801 1.7883 1.3323 1.4077 2.1527 2.3426 10.5139 5.2090 2.6935 2.7013 1.2583 2.6598 1.4673 1.3411 1.7920 2.6897 1.1617 1.1701 1.2296 1.2404 1.2519 1.2450 1.2549 1.2510 1.1252 1.0529 1.0456 1.0461 1.0503 1.0411 1.0466 1.0776 1.0782 1.0312 1.0682 1.0652 1.0372 1.0362 1.1038 1.0966 1.0947 1.0986 1.0984 1.1009 1.1009 1.1002 1.0750 1.0760
irintensity: 0.2433 1.3069 1.3484 0.4485 3.6771 1.9699 1.5159 2.0222 15.6102 0.3568 5.8853 2.9573 15.8726 2.1809 13.4605 0.3005 29.1553 78.9348 39.2427 122.6232 85.0266 84.2314 110.0512 8.4576 21.6733 6.9310 57.6086 127.0848 82.8210 20.8197 36.9874 0.8484 269.1880 20.7179 11.1573 11.0410 3.6388 34.8051 18.0357 0.4788 0.2953 36.2150 28.6318 40.8226 1.2634 3.4221 6.5107 3.3532 16.6688 15.1383 1.4224 5.7008 11.9341 7.5045 56.5237 62.3070 58.9352 32.6636 28.8489 50.0132 2.6717 0.1833 42.3364 44.6605 47.4891 41.7058 19.7819 10.4506 11.5585
temp: 298.150 k
press: 1.00000 atm
elementType: 15 8 8 7 7 6 6 6 6 6 1 1 1 1 1 1 1 1 1 1 1 1 1 1 1
symmnumber: 1
zpe: 550415.7 jmol-1
zpe.correction: 0.209642 hartree
zpe.thermalcorrener: 0.223975 hartree
zpe.thermalcorrenthalpy: 0.224919 hartree
zpe.thermalcorrgfe: 0.167752 hartree
zpe.sumelectzpe: -799.833871 hartree
zpe.sumelectthermal: -799.819538 hartree
zpe.sumelectthermalent: -799.818594 hartree
zpe.sumelectthermalfe: -799.875762 hartree
dipole: -0.8791 -1.6000 -5.5514
dipole: 5.8438
quadrupole: -61.0049 -67.5249 -77.6432
quadrupole: 1.0089 -3.3476 -4.5346
quadrupole: 7.7194 1.1995 -8.9189 1.0089 -3.3476 -4.5346
hfenergy: -800.0435136 hartree
pointgroup: C01 [X(C5H15N2O2P1)]
dipole: -0.2757701 -0.2543916 2.268319 debye
dipolederiv: 2.3619505 0.0562182 -0.0130465 -0.0830334 1.9402671 -0.1101722 0.0943526 0.2385634 1.5826392 -0.7228595 -0.1978249 0.0798533 -0.2101686 -1.2033401 0.2001118 0.0733668 0.2277069 -0.5814352 -0.7861613 -0.0245051 0.0358205 0.0050674 -0.6484364 0.0454337 0.0662909 -0.0026798 -0.7060059 -1.2211719 0.2164599 0.1229058 0.1419317 -0.5792105 0.1103927 0.1757582 0.0174381 -0.7039742 -1.3033746 -0.0916538 -0.1883162 -0.0451519 -0.7821331 -0.0706846 -0.2627149 -0.1307939 -0.5837205 0.7441805 -0.1284028 -0.0224297 0.0508135 0.213303 -0.0940723 0.2097313 -0.1543193 0.180344 0.8264168 0.0675945 0.0936408 0.0640319 0.3242531 0.0340947 -0.2026792 0.0022627 0.0494933 -0.1132311 0.0214808 0.0896921 0.0131816 0.0961358 0.0268291 0.0647358 0.0193091 -0.0135355 -0.0913176 -0.0764032 -0.049514 -0.0660388 -0.0388156 -0.0750922 -0.0434101 -0.0677838 0.0781905 0.2871076 -0.0339185 -0.0203 0.0137031 0.4624511 -0.098138 -0.1282272 -0.3899948 0.3260199 0.0951904 0.020689 0.0078837 -0.0469538 0.1103209 -0.1025698 -0.0366568 -0.0845661 0.2529478 0.0795499 -0.0315954 -0.022606 0.0011278 0.3329314 0.0703839 0.0508007 0.0692425 0.0878316 -0.0921244 0.0496043 -0.0112568 0.1035331 -0.0620122 0.1323712 -0.0798708 0.1268408 -0.041348 0.0771175 -0.0031451 0.0201409 -0.0451571 -0.0394163 -0.0849927 -0.0200194 -0.0620424 0.0262748 -0.1515331 0.0646786 -0.020471 0.122985 -0.1542359 -0.0031416 -0.0348704 0.0187087 0.0860645 0.1157474 -0.0038727 -0.0356363 -0.0230813 0.0803652 0.017374 0.0493115 0.0096654 -0.0406343 0.1070591 0.0551017 -0.0506662 0.0218085 -0.0607595 0.1310926 -0.0107025 0.105348 -0.0184026 0.0888448 -0.0625012 -0.0293078 -0.0181227 -0.106787 -0.1308903 0.0173109 -0.0957081 0.006414 -0.2028677 0.0043192 -0.0254339 -0.0094939 0.1082372 -0.0087498 -0.0554819 -0.0119059 0.0632772 0.0693015 0.1221049 -0.0169417 0.0691073 -0.105842 0.0090515 -0.0243905 0.0318953 0.0740072 0.0980543 -0.0124629 0.0375048 -0.0181701 0.0544424 0.0701375 -0.0149572 0.020732 -0.1783836 -0.2059288 -0.0502214 0.0362835 -0.0414761 0.0876413 -0.0189807 0.0593283 -0.0092148 0.0730743 -0.0218575 0.0302562 0.1090091 0.0614996 0.0431624 -0.0568969 0.1342138 0.0347468 -0.0830732 -0.1100605 0.1076442 -0.0982245 0.0280854 0.0441668 0.0401823 -0.0612725 0.1200723 0.0000255 0.0719675 -0.0996445 -0.0285842 -0.090028 -0.1166889 -0.0330738 -0.0199475 -0.033523 0.063909 unknown
polarizability: 117.3622038|4.8859664|91.551865|-2.064396|-0.5911413|87.9667912 unknown
InChI: InChI=1S/C5H15N2O2P/c1-4-6-10(8,9-3)7-5-2/h6-7H,4-5H2,1-3H3
charge 0 multiplicity 1
25 atoms
P  0.166861 -0.050875 -0.6665
O  -0.459162 -1.661749 -0.985746
O  0.601531 0.605732 -2.049894
N  -1.116493 0.585266 0.328864
N  1.449963 -0.071976 0.488176
C  -2.541005 0.520905 -0.082437
C  2.871016 0.066281 0.107677
C  -3.459851 0.56075 1.151736
C  3.573432 1.176885 0.91244
C  -0.613721 -2.595653 0.14233
H  -0.859349 1.423154 0.861804
H  1.232464 -0.305309 1.458949
H  -2.799687 1.348472 -0.775387
H  -2.683485 -0.421989 -0.639447
H  3.404338 -0.896801 0.242281
H  2.891294 0.307851 -0.970526
H  -3.241113 -0.283791 1.828616
H  -3.326152 1.500533 1.720172
H  -4.520096 0.50218 0.844806
H  3.092135 2.1527 0.727032
H  3.537723 0.971622 1.999346
H  4.636961 1.248989 0.618474
H  -1.289684 -2.189593 0.920189
H  0.367433 -2.840079 0.594257
H  -1.050554 -3.506106 -0.296712
